{"text_format":"1","workbook":"xlsx","n_sheets":5,"sheets":["Calculos","Hoja1","Hoja1 (2)","Simulador","Calculos PLD"],"not_rendered":{"charts":0,"images":2,"macros":0,"external_links":0,"defined_names":0,"comments":1,"pivot_tables":0},"unopened":[],"bounds":{"document_bytes":16777216,"sheet_cells":100000,"rows_first":2000,"rows_last":500,"rows_between":2000,"halvings":0,"cell_chars":16384,"cell_head_chars":4096},"cells_cut":0,"cells_raw":0,"read":"whole","date_system":"1900"}

{"sheet":"Calculos","index":0,"n_rows":386,"n_cols":7,"rows_kept":386,"cut":false,"hidden":true,"merged":[[0,0,0,6]]}
["Factores utilizados en Meses de No Pago para cálculo del valor cuota"]
[]
["N° de Cuota","Equivalente","Fecha","Mes","Marca Cuota No Pago","Factor (10)","Acumulado"]
[1,{"$f":"IF(E4<>\"C\",IF(ISERROR(1+B3)=TRUE,1,1+B3),IF(ISNUMBER(B3),B3,1))","v":1},{"$f":"+#REF!","v":{"$error":"#REF!"}},{"$f":"MONTH(C4)","v":{"$error":"#REF!"}},{"$f":"IF(ISERROR(MATCH(D4,#REF!,0))=FALSE,\"C\",IF(ISERROR(MATCH(D4,#REF!,0))=FALSE,\"D\",\"\"))","v":""},{"$f":"IF(E4=\"C\",0,IF(E4 =\"D\",ROUND(1/((1+#REF!)^A4),9) * 2,ROUND(1/((1+#REF!)^A4),9)))","v":{"$error":"#REF!"}},{"$f":"ROUND(F4,9)","v":{"$error":"#REF!"}}]
[{"$f":"A4+1","v":2},{"$f":"IF(E5<>\"C\",IF(ISERROR(1+B4)=TRUE,1,1+B4),IF(ISNUMBER(B4),B4,1))","v":2},{"$f":"DATE(YEAR(C4) + 1/12,MONTH(C4)+1,DAY(C4))","v":{"$error":"#REF!"}},{"$error":"#REF!"},{"$f":"IF(ISERROR(MATCH(D5,#REF!,0))=FALSE,\"C\",IF(ISERROR(MATCH(D5,#REF!,0))=FALSE,\"D\",\"\"))","v":""},{"$f":"IF(E5=\"C\",0,IF(E5 =\"D\",ROUND(1/((1+#REF!)^A5),9) * 2,ROUND(1/((1+#REF!)^A5),9)))","v":{"$error":"#REF!"}},{"$f":"G4+ROUND(F5,9)","v":{"$error":"#REF!"}}]
[3,3,{"$error":"#REF!"},{"$error":"#REF!"},{"$f":"IF(ISERROR(MATCH(D6,#REF!,0))=FALSE,\"C\",IF(ISERROR(MATCH(D6,#REF!,0))=FALSE,\"D\",\"\"))","v":""},{"$f":"IF(E6=\"C\",0,IF(E6 =\"D\",ROUND(1/((1+#REF!)^A6),9) * 2,ROUND(1/((1+#REF!)^A6),9)))","v":{"$error":"#REF!"}},{"$f":"G5+ROUND(F6,9)","v":{"$error":"#REF!"}}]
[4,4,{"$error":"#REF!"},{"$error":"#REF!"},{"$f":"IF(ISERROR(MATCH(D7,#REF!,0))=FALSE,\"C\",IF(ISERROR(MATCH(D7,#REF!,0))=FALSE,\"D\",\"\"))","v":""},{"$f":"IF(E7=\"C\",0,IF(E7 =\"D\",ROUND(1/((1+#REF!)^A7),9) * 2,ROUND(1/((1+#REF!)^A7),9)))","v":{"$error":"#REF!"}},{"$error":"#REF!"}]
[5,5,{"$error":"#REF!"},{"$error":"#REF!"},{"$f":"IF(ISERROR(MATCH(D8,#REF!,0))=FALSE,\"C\",IF(ISERROR(MATCH(D8,#REF!,0))=FALSE,\"D\",\"\"))","v":""},{"$f":"IF(E8=\"C\",0,IF(E8 =\"D\",ROUND(1/((1+#REF!)^A8),9) * 2,ROUND(1/((1+#REF!)^A8),9)))","v":{"$error":"#REF!"}},{"$error":"#REF!"}]
[6,6,{"$error":"#REF!"},{"$error":"#REF!"},{"$f":"IF(ISERROR(MATCH(D9,#REF!,0))=FALSE,\"C\",IF(ISERROR(MATCH(D9,#REF!,0))=FALSE,\"D\",\"\"))","v":""},{"$f":"IF(E9=\"C\",0,IF(E9 =\"D\",ROUND(1/((1+#REF!)^A9),9) * 2,ROUND(1/((1+#REF!)^A9),9)))","v":{"$error":"#REF!"}},{"$error":"#REF!"}]
[7,7,{"$error":"#REF!"},{"$error":"#REF!"},{"$f":"IF(ISERROR(MATCH(D10,#REF!,0))=FALSE,\"C\",IF(ISERROR(MATCH(D10,#REF!,0))=FALSE,\"D\",\"\"))","v":""},{"$f":"IF(E10=\"C\",0,IF(E10 =\"D\",ROUND(1/((1+#REF!)^A10),9) * 2,ROUND(1/((1+#REF!)^A10),9)))","v":{"$error":"#REF!"}},{"$error":"#REF!"}]
[8,8,{"$error":"#REF!"},{"$error":"#REF!"},{"$f":"IF(ISERROR(MATCH(D11,#REF!,0))=FALSE,\"C\",IF(ISERROR(MATCH(D11,#REF!,0))=FALSE,\"D\",\"\"))","v":""},{"$f":"IF(E11=\"C\",0,IF(E11 =\"D\",ROUND(1/((1+#REF!)^A11),9) * 2,ROUND(1/((1+#REF!)^A11),9)))","v":{"$error":"#REF!"}},{"$error":"#REF!"}]
[9,9,{"$error":"#REF!"},{"$error":"#REF!"},{"$f":"IF(ISERROR(MATCH(D12,#REF!,0))=FALSE,\"C\",IF(ISERROR(MATCH(D12,#REF!,0))=FALSE,\"D\",\"\"))","v":""},{"$f":"IF(E12=\"C\",0,IF(E12 =\"D\",ROUND(1/((1+#REF!)^A12),9) * 2,ROUND(1/((1+#REF!)^A12),9)))","v":{"$error":"#REF!"}},{"$error":"#REF!"}]
[10,10,{"$error":"#REF!"},{"$error":"#REF!"},{"$f":"IF(ISERROR(MATCH(D13,#REF!,0))=FALSE,\"C\",IF(ISERROR(MATCH(D13,#REF!,0))=FALSE,\"D\",\"\"))","v":""},{"$f":"IF(E13=\"C\",0,IF(E13 =\"D\",ROUND(1/((1+#REF!)^A13),9) * 2,ROUND(1/((1+#REF!)^A13),9)))","v":{"$error":"#REF!"}},{"$error":"#REF!"}]
[11,11,{"$error":"#REF!"},{"$error":"#REF!"},{"$f":"IF(ISERROR(MATCH(D14,#REF!,0))=FALSE,\"C\",IF(ISERROR(MATCH(D14,#REF!,0))=FALSE,\"D\",\"\"))","v":""},{"$f":"IF(E14=\"C\",0,IF(E14 =\"D\",ROUND(1/((1+#REF!)^A14),9) * 2,ROUND(1/((1+#REF!)^A14),9)))","v":{"$error":"#REF!"}},{"$error":"#REF!"}]
[12,12,{"$error":"#REF!"},{"$error":"#REF!"},{"$f":"IF(ISERROR(MATCH(D15,#REF!,0))=FALSE,\"C\",IF(ISERROR(MATCH(D15,#REF!,0))=FALSE,\"D\",\"\"))","v":""},{"$f":"IF(E15=\"C\",0,IF(E15 =\"D\",ROUND(1/((1+#REF!)^A15),9) * 2,ROUND(1/((1+#REF!)^A15),9)))","v":{"$error":"#REF!"}},{"$error":"#REF!"}]
[13,13,{"$error":"#REF!"},{"$error":"#REF!"},{"$f":"IF(ISERROR(MATCH(D16,#REF!,0))=FALSE,\"C\",IF(ISERROR(MATCH(D16,#REF!,0))=FALSE,\"D\",\"\"))","v":""},{"$f":"IF(E16=\"C\",0,IF(E16 =\"D\",ROUND(1/((1+#REF!)^A16),9) * 2,ROUND(1/((1+#REF!)^A16),9)))","v":{"$error":"#REF!"}},{"$error":"#REF!"}]
[14,14,{"$error":"#REF!"},{"$error":"#REF!"},{"$f":"IF(ISERROR(MATCH(D17,#REF!,0))=FALSE,\"C\",IF(ISERROR(MATCH(D17,#REF!,0))=FALSE,\"D\",\"\"))","v":""},{"$f":"IF(E17=\"C\",0,IF(E17 =\"D\",ROUND(1/((1+#REF!)^A17),9) * 2,ROUND(1/((1+#REF!)^A17),9)))","v":{"$error":"#REF!"}},{"$error":"#REF!"}]
[15,15,{"$error":"#REF!"},{"$error":"#REF!"},{"$f":"IF(ISERROR(MATCH(D18,#REF!,0))=FALSE,\"C\",IF(ISERROR(MATCH(D18,#REF!,0))=FALSE,\"D\",\"\"))","v":""},{"$f":"IF(E18=\"C\",0,IF(E18 =\"D\",ROUND(1/((1+#REF!)^A18),9) * 2,ROUND(1/((1+#REF!)^A18),9)))","v":{"$error":"#REF!"}},{"$error":"#REF!"}]
[16,16,{"$error":"#REF!"},{"$error":"#REF!"},{"$f":"IF(ISERROR(MATCH(D19,#REF!,0))=FALSE,\"C\",IF(ISERROR(MATCH(D19,#REF!,0))=FALSE,\"D\",\"\"))","v":""},{"$f":"IF(E19=\"C\",0,IF(E19 =\"D\",ROUND(1/((1+#REF!)^A19),9) * 2,ROUND(1/((1+#REF!)^A19),9)))","v":{"$error":"#REF!"}},{"$error":"#REF!"}]
[17,17,{"$error":"#REF!"},{"$error":"#REF!"},{"$f":"IF(ISERROR(MATCH(D20,#REF!,0))=FALSE,\"C\",IF(ISERROR(MATCH(D20,#REF!,0))=FALSE,\"D\",\"\"))","v":""},{"$f":"IF(E20=\"C\",0,IF(E20 =\"D\",ROUND(1/((1+#REF!)^A20),9) * 2,ROUND(1/((1+#REF!)^A20),9)))","v":{"$error":"#REF!"}},{"$error":"#REF!"}]
{"$rows_left_out":367}
{"sheet":"Hoja1","index":1,"n_rows":15,"n_cols":13,"rows_kept":15,"cut":false,"hidden":false,"merged":[[15,0,15,1],[16,0,16,1],[18,0,18,3],[2,1,3,3],[4,0,5,3]]}
[]
[]
[null,"SIMULADOR PRÉSTAMO PERSONAL\nCON GARANTÍA",null,null,null,null,"Soles"]
[null,null,null,null,null,null,"Dólares"]
["Nota: Para hacer uso del simulador, debe tener habilitado y desbloqueado la opción de macros en su equipo. Luego de habiliarlo ingrese todos los valores a simular,después de click a Calcular y luego a Generar cronograma para visualizar el Cronograma Simulado"]
[null,null,null,null,null,null,"No"]
[null,"Moneda","Soles",null,null,null,"Julio"]
[null,"Monto del Préstamo",50000,null,null,null,"Diciembre"]
[null,"Fecha de Desembolso","2025-06-10",null,null,null,null,null,null,null,null,null,0]
[null,"Plazo",48,null,null,null,"Seguro sin retorno",null,null,null,null,null,30]
[null,"TEA*",10.7,null,null,null,"Seguro con retorno",null,null,null,null,null,60]
[null,"Días de Gracia",0,null,null,null,"Endoso o sin seguro",null,null,null,null,null,90]
[null,"Seguro Desgravamen**","Endoso o sin seguro"]
[null,"Cuota Doble 1","No",null,null,null,null,{"$f":"+Simulador!Q29","v":5.4166666667248835E-2},{"$f":"+Simulador!W28","v":0}]
[null,"Cuota Doble 2","No",null,null,null,null,null,{"$f":"+IF(AND(I14>-1,I14<1),\"CORRECTO\",\"INCORRECTO\")","v":"CORRECTO"}]

{"sheet":"Hoja1 (2)","index":2,"n_rows":68,"n_cols":9,"rows_kept":68,"cut":false,"hidden":false,"merged":[[14,1,14,2],[13,1,13,2],[13,5,13,6],[4,1,4,7],[5,1,5,7],[8,1,8,2],[9,1,9,2],[10,1,10,2],[11,1,11,2],[12,1,12,2],[8,5,8,6],[9,5,9,6],[10,5,10,6],[11,5,11,6],[12,5,12,6]]}
[]
[]
[]
[]
[null,"(SIMULACIÓN)"]
[null,"CRONOGRAMA DE PAGOS"]
[]
[]
[null,"Moneda                                                  :",null,{"$f":"+Hoja1!C7","v":"Soles"},null,"Monto del Préstamo                                                    :",null,{"$f":"+Hoja1!C8","v":50000}]
[null,"Producto                                                :",null,"Préstamo Personal con Garantía",null,"Tasa Efectiva Anual (fija)                                                     :",null,{"$f":"+Hoja1!C11&\"%\"","v":"10.7%"}]
[null,"Fecha de desembolso                          :",null,{"$f":"+Hoja1!C9","v":"2025-06-10"},null,"Plazo (en meses)                                                          :",null,{"$f":"+Hoja1!C10","v":48}]
[null,"Mes de Cuota Doble 1                          :",null,{"$f":"+Hoja1!C14","v":"No"},null,"Tasa de Costo Efectiva Anual                                     :",null,{"$f":"+Simulador!Q18","v":0.10700045436028738},{"$f":"+RATE(H11,H18,-H9-I13)","v":8.6330955494775471E-3}]
[null,"Mes de Cuota Doble 2                          :",null,{"$f":"+Hoja1!C15","v":"No"},null,"Tasa Seguro de Desgravamen Mensual                   :",null,{"$f":"+IF(Hoja1!C13=\"Endoso o sin seguro\",0,IF(Hoja1!C13=\"Seguro con retorno\",0.346%,0.18%))","v":0},{"$f":"Simulador!Q16","v":0}]
[null,"Periodo de gracia                                 :",null,{"$f":"+Hoja1!C12&\" \"& \"días\"","v":"0 días"}]
[null,"Frecuencia de pago                             :",null,"Mensual"]
[null,{"$f":"+IF(AND(Simulador!W28<1,Simulador!W28>-1),\"\",\"No ha presionado el botón de calcular, por favor volver a simular\")","v":""}]
[null,"N°","Fecha Vencimiento","Capital","Interes","Interes de Gracia","Seguro Desgravamen","Total Cuota"]
[null,1,{"$f":"IFERROR(+IF(B18>0,VLOOKUP(B18,Simulador!$A$32:$T$550,3,0),\" \"),\" \")","v":"2025-07-10"},{"$f":"IFERROR(+IF(B18>0,VLOOKUP(B18,Simulador!$A$32:$T$550,11,0),\" \"),\" \")","v":851.42416666666725},{"$f":"IFERROR(+IF(B18>0,VLOOKUP(B18,Simulador!$A$32:$T$550,12,0),\" \"),\" \")","v":425.36},{"$f":"IFERROR(+IF(B18>0,VLOOKUP(B18,Simulador!$A$32:$T$550,13,0),\" \"),\" \")","v":0},{"$f":"IFERROR(+IF(B18>0,VLOOKUP(B18,Simulador!$A$32:$T$550,20,0),\" \"),\" \")","v":0},{"$f":"IFERROR(+IF(B18>0,VLOOKUP(B18,Simulador!$A$32:$Z$550,22,0),\" \"),\" \")","v":1276.7841666666673}]
[null,{"$f":"IF(B18=0,\" \",IF(B18>=$H$11,\"\",B18+1))","v":2},{"$f":"IF($H$11=0,\" \",IF(B18=$H$11,\"TOTALES\",+IF(B19>0,VLOOKUP(B19,Simulador!$A$32:$T$550,3,0),\" \")))","v":"2025-08-10"},{"$f":"IF($H$11=0,\" \",IF(B18=$H$11,Simulador!$J$33,+IF(B19>0,VLOOKUP(B19,Simulador!$A$32:$T$550,11,0),\" \")))","v":844.67416666666725},{"$f":"IF($H$11=0,\" \",IF(B18=$H$11,Simulador!$L$31,+IF(B19>0,VLOOKUP(B19,Simulador!$A$32:$T$550,12,0),\" \")))","v":432.11},{"$f":"IF($H$11=0,\" \",IF(B18=$H$11,Simulador!$M$31,+IF(B19>0,VLOOKUP(B19,Simulador!$A$32:$T$550,13,0),\" \")))","v":0},{"$f":"IF($H$11=0,\" \",IF(B18=$H$11,Simulador!$T$31,+IF(B19>0,VLOOKUP(B19,Simulador!$A$32:$T$550,20,0),\" \")))","v":0},{"$f":"IF($H$11=0,\" \",IF(B18=$H$11,Simulador!$V$31,+IF(B19>0,VLOOKUP(B19,Simulador!$A$32:$Z$550,22,0),\" \")))","v":1276.7841666666673}]
[null,{"$f":"IF(B19=0,\" \",IF(B19>=$H$11,\"\",B19+1))","v":3},{"$f":"IF($H$11=0,\" \",IF(B19=$H$11,\"TOTALES\",+IF(B20>0,VLOOKUP(B20,Simulador!$A$32:$T$550,3,0),\" \")))","v":"2025-09-10"},{"$f":"IF($H$11=0,\" \",IF(B19=$H$11,Simulador!$J$33,+IF(B20>0,VLOOKUP(B20,Simulador!$A$32:$T$550,11,0),\" \")))","v":852.1041666666672},{"$f":"IF($H$11=0,\" \",IF(B19=$H$11,Simulador!$L$31,+IF(B20>0,VLOOKUP(B20,Simulador!$A$32:$T$550,12,0),\" \")))","v":424.68},{"$f":"IF($H$11=0,\" \",IF(B19=$H$11,Simulador!$M$31,+IF(B20>0,VLOOKUP(B20,Simulador!$A$32:$T$550,13,0),\" \")))","v":0},{"$f":"IF($H$11=0,\" \",IF(B19=$H$11,Simulador!$T$31,+IF(B20>0,VLOOKUP(B20,Simulador!$A$32:$T$550,20,0),\" \")))","v":0},{"$f":"IF($H$11=0,\" \",IF(B19=$H$11,Simulador!$V$31,+IF(B20>0,VLOOKUP(B20,Simulador!$A$32:$Z$550,22,0),\" \")))","v":1276.7841666666673}]
{"$rows_left_out":49}
{"sheet":"Simulador","index":3,"n_rows":275,"n_cols":45,"rows_kept":275,"cut":false,"hidden":true,"merged":[[1,2,1,22],[28,17,28,18],[31,35,31,36]]}
[]
[null,null,"SIMULADOR DE CUOTAS - CRÉDITO PLD"]
[]
[]
[null,null,"Importe Solicitado",null,null,null,null,{"$f":"+Hoja1!C8","v":50000},null,null,null,"Fecha Desembolso",null,null,null,null,{"$f":"+Hoja1!C9","v":"2025-06-10"}]
[null,null,"Saldo de Capital",null,null,null,null,{"$f":"H5","v":50000},null,null,null,"Fecha Final de Gracia",null,null,null,null,{"$f":"+DATE(YEAR(Q5+H15),MONTH(Q5+H15),DAY(Q5+H15))","v":"2025-06-10"}]
[null,null,"Saldo de Interes",null,null,null,null,0,null,null,null,"Fecha de la 1° cuota",null,null,null,null,{"$f":"DATE(YEAR(EDATE(Q6,1)),MONTH(EDATE(Q6,1)),DAY(EDATE(Q6,1)))","v":"2025-07-10"}]
[null,null,"Tasa Anual (TEA)",null,null,null,null,{"$f":"+Hoja1!C11","v":10.7},null,null,null,"Fecha final de vencimiento",null,null,null,null,{"$f":"IF(OR($H$16>0,$H$17>0),VLOOKUP($H$14,$A$33:$C$272,3,0),DATE(YEAR(EDATE(Q6,H14)),MONTH(EDATE(Q6,H14)),DAY(EDATE(Q6,H14))))","v":"2029-06-10"}]
[null,null,"Tasa de Seguro de Desgravamen",null,null,null,null,{"$f":"+IF(Hoja1!C13=\"Endoso o sin seguro\",0,IF(Hoja1!C13=\"Seguro con retorno\",0.346%,0.18%))","v":0},null,null,null,"Base",null,null,null,null,360]
[null,null,"Tasa Anual (TEA) - Ajustada",null,null,null,null,{"$f":"+H8","v":10.7},null,null,null,"Frecuencia pago en días",null,null,null,null,30,{"$f":"+((1+22%)^(1/12)-1)*12*100","v":20.050756647753776},{"$f":"+(Q11%)*Q12/Q9","v":8.631181321180556E-3}]
[null,null,"Comision por Env. Inf",null,null,null,null,0,null,null,null,"Tasa Equivalente - Ajustada",null,null,null,null,{"$f":"ROUND((((H10/100+1)^(1/(Q9/Q10))-1)*Q9/Q10)*100,6)","v":10.208543000000001},"tea conv. A tem luego nominal anual"]
[null,null,"Valor Asegurable",null,null,null,null,0,null,null,null,"Días entre cuotas",null,null,null,null,{"$f":"(Q8-Q6)/H14","v":30.4375},"dias promedio entre cuotas"]
[null,null,"Tasa de Seguro Todo Riesgo",null,null,null,null,0,{"$f":"+H13*12","v":0},{"$f":"+I13/365*30*H12","v":0},null,"Factor Aplicado - Ajustada",null,null,null,null,{"$f":"ROUND(($Q$11/100)/($Q$9/$Q$12),8)","v":8.6311800000000004E-3},"tem convertida de manera nominal a los dias entre cuotas"]
[null,null,"Plazo y  Nro. Cuotas",null,null,null,null,{"$f":"+Hoja1!C10","v":48},{"$f":"H14","v":48},null,null,"Factor Aplicado para la cuota - Ajustada",null,null,null,null,{"$f":"1/((1-((1+$Q$13)^(-1*$H$14)))/$Q$13)","v":2.553457496999401E-2},"Factor de cuota (ok)"]
[null,null,"Días de Gracia",null,null,null,null,{"$f":"+Hoja1!C12","v":0},null,null,null,"Interes de Gracia  (Se considera la TEA Normal)",null,null,null,null,{"$f":"IF(H15>0,ROUND(H6*(((1+H8/100)^(ABS(H15)/Q9))-1),4),ROUND(H6*(((1+H8/100)^(ABS(H15)/Q9))-1),4) * -1)","v":0},"Ok"]
[null,null,"Mes de No Pago 1",null,null,null,null,0,null,null,null,"Saldo Interes +/- Interes Gracia",null,null,null,null,{"$f":"IF(H7 + Q15>0,H7+ Q15,0)","v":0}]
[null,null,"Mes de No Pago 2",null,null,null,null,0,null,null,null,"Seg Desg de Gracia",null,null,null,null,{"$f":"IF(H15>0,ROUNDDOWN(H5*H9/30*H15,2),ROUNDDOWN(H5*H9/30*H15,2)*0)","v":0}]
[null,null,"Mes Cuota Doble 1",null,null,null,null,{"$f":"+IF(Hoja1!C14=\"No\",0,IF(Hoja1!C14=\"Julio\",7,12))","v":0},null,null,null,"TCEA",null,null,null,null,{"$f":"+$AH$31","v":0.10700045436028738}]
[null,null,"Mes Cuota Doble 2",null,null,null," ",{"$f":"+IF(Hoja1!C15=\"No\",0,IF(Hoja1!C15=\"Julio\",7,12))","v":0}]
[]
{"$rows_left_out":256}
{"sheet":"Calculos PLD","index":4,"n_rows":386,"n_cols":7,"rows_kept":386,"cut":false,"hidden":true,"merged":[[0,0,0,6]]}
["Factores utilizados en Meses de No Pago para cálculo del valor cuota"]
[]
["N° de Cuota","Equivalente","Fecha","Mes","Marca Cuota No Pago","Factor (10)","Acumulado"]
[1,{"$f":"IF(E4<>\"C\",IF(ISERROR(1+B3)=TRUE,1,1+B3),IF(ISNUMBER(B3),B3,1))","v":1},{"$f":"Simulador!Q7","v":"2025-07-10"},{"$f":"MONTH(C4)","v":7},{"$f":"IF(ISERROR(MATCH(D4,Simulador!$H$16:$H$17,0))=FALSE,\"C\",IF(ISERROR(MATCH(D4,Simulador!$H$18:$H$19,0))=FALSE,\"D\",\"\"))","v":""},{"$f":"IF(E4=\"C\",0,IF(E4 =\"D\",ROUND(1/((1+Simulador!$Q$13)^A4),9) * 2,ROUND(1/((1+Simulador!$Q$13)^A4),9)))","v":0.99144268000000002},{"$f":"ROUND(F4,9)","v":0.99144268000000002}]
[{"$f":"A4+1","v":2},{"$f":"IF(E5<>\"C\",IF(ISERROR(1+B4)=TRUE,1,1+B4),IF(ISNUMBER(B4),B4,1))","v":2},{"$f":"DATE(YEAR(C4) + 1/12,MONTH(C4)+1,DAY(C4))","v":"2025-08-10"},8,{"$f":"IF(ISERROR(MATCH(D5,Simulador!$H$16:$H$17,0))=FALSE,\"C\",IF(ISERROR(MATCH(D5,Simulador!$H$18:$H$19,0))=FALSE,\"D\",\"\"))","v":""},{"$f":"IF(E5=\"C\",0,IF(E5 =\"D\",ROUND(1/((1+Simulador!$Q$13)^A5),9) * 2,ROUND(1/((1+Simulador!$Q$13)^A5),9)))","v":0.98295858700000005},{"$f":"G4+ROUND(F5,9)","v":1.9744012670000002}]
[3,3,"2025-09-10",9,{"$f":"IF(ISERROR(MATCH(D6,Simulador!$H$16:$H$17,0))=FALSE,\"C\",IF(ISERROR(MATCH(D6,Simulador!$H$18:$H$19,0))=FALSE,\"D\",\"\"))","v":""},{"$f":"IF(E6=\"C\",0,IF(E6 =\"D\",ROUND(1/((1+Simulador!$Q$13)^A6),9) * 2,ROUND(1/((1+Simulador!$Q$13)^A6),9)))","v":0.974547096},{"$f":"G5+ROUND(F6,9)","v":2.9489483630000004}]
[4,4,"2025-10-10",10,{"$f":"IF(ISERROR(MATCH(D7,Simulador!$H$16:$H$17,0))=FALSE,\"C\",IF(ISERROR(MATCH(D7,Simulador!$H$18:$H$19,0))=FALSE,\"D\",\"\"))","v":""},{"$f":"IF(E7=\"C\",0,IF(E7 =\"D\",ROUND(1/((1+Simulador!$Q$13)^A7),9) * 2,ROUND(1/((1+Simulador!$Q$13)^A7),9)))","v":0.96620758399999995},3.9151559470000006]
[5,5,"2025-11-10",11,{"$f":"IF(ISERROR(MATCH(D8,Simulador!$H$16:$H$17,0))=FALSE,\"C\",IF(ISERROR(MATCH(D8,Simulador!$H$18:$H$19,0))=FALSE,\"D\",\"\"))","v":""},{"$f":"IF(E8=\"C\",0,IF(E8 =\"D\",ROUND(1/((1+Simulador!$Q$13)^A8),9) * 2,ROUND(1/((1+Simulador!$Q$13)^A8),9)))","v":0.95793943699999995},4.8730953840000009]
[6,6,"2025-12-10",12,{"$f":"IF(ISERROR(MATCH(D9,Simulador!$H$16:$H$17,0))=FALSE,\"C\",IF(ISERROR(MATCH(D9,Simulador!$H$18:$H$19,0))=FALSE,\"D\",\"\"))","v":""},{"$f":"IF(E9=\"C\",0,IF(E9 =\"D\",ROUND(1/((1+Simulador!$Q$13)^A9),9) * 2,ROUND(1/((1+Simulador!$Q$13)^A9),9)))","v":0.94974204200000001},5.8228374260000013]
[7,7,"2026-01-10",1,{"$f":"IF(ISERROR(MATCH(D10,Simulador!$H$16:$H$17,0))=FALSE,\"C\",IF(ISERROR(MATCH(D10,Simulador!$H$18:$H$19,0))=FALSE,\"D\",\"\"))","v":""},{"$f":"IF(E10=\"C\",0,IF(E10 =\"D\",ROUND(1/((1+Simulador!$Q$13)^A10),9) * 2,ROUND(1/((1+Simulador!$Q$13)^A10),9)))","v":0.941614795},6.7644522210000009]
[8,8,"2026-02-10",2,{"$f":"IF(ISERROR(MATCH(D11,Simulador!$H$16:$H$17,0))=FALSE,\"C\",IF(ISERROR(MATCH(D11,Simulador!$H$18:$H$19,0))=FALSE,\"D\",\"\"))","v":""},{"$f":"IF(E11=\"C\",0,IF(E11 =\"D\",ROUND(1/((1+Simulador!$Q$13)^A11),9) * 2,ROUND(1/((1+Simulador!$Q$13)^A11),9)))","v":0.93355709600000003},7.6980093170000012]
[9,9,"2026-03-10",3,{"$f":"IF(ISERROR(MATCH(D12,Simulador!$H$16:$H$17,0))=FALSE,\"C\",IF(ISERROR(MATCH(D12,Simulador!$H$18:$H$19,0))=FALSE,\"D\",\"\"))","v":""},{"$f":"IF(E12=\"C\",0,IF(E12 =\"D\",ROUND(1/((1+Simulador!$Q$13)^A12),9) * 2,ROUND(1/((1+Simulador!$Q$13)^A12),9)))","v":0.92556834899999996},8.623577666000001]
[10,10,"2026-04-10",4,{"$f":"IF(ISERROR(MATCH(D13,Simulador!$H$16:$H$17,0))=FALSE,\"C\",IF(ISERROR(MATCH(D13,Simulador!$H$18:$H$19,0))=FALSE,\"D\",\"\"))","v":""},{"$f":"IF(E13=\"C\",0,IF(E13 =\"D\",ROUND(1/((1+Simulador!$Q$13)^A13),9) * 2,ROUND(1/((1+Simulador!$Q$13)^A13),9)))","v":0.91764796400000004},9.5412256300000013]
[11,11,"2026-05-10",5,{"$f":"IF(ISERROR(MATCH(D14,Simulador!$H$16:$H$17,0))=FALSE,\"C\",IF(ISERROR(MATCH(D14,Simulador!$H$18:$H$19,0))=FALSE,\"D\",\"\"))","v":""},{"$f":"IF(E14=\"C\",0,IF(E14 =\"D\",ROUND(1/((1+Simulador!$Q$13)^A14),9) * 2,ROUND(1/((1+Simulador!$Q$13)^A14),9)))","v":0.90979535700000003},10.451020987000001]
[12,12,"2026-06-10",6,{"$f":"IF(ISERROR(MATCH(D15,Simulador!$H$16:$H$17,0))=FALSE,\"C\",IF(ISERROR(MATCH(D15,Simulador!$H$18:$H$19,0))=FALSE,\"D\",\"\"))","v":""},{"$f":"IF(E15=\"C\",0,IF(E15 =\"D\",ROUND(1/((1+Simulador!$Q$13)^A15),9) * 2,ROUND(1/((1+Simulador!$Q$13)^A15),9)))","v":0.90200994599999995},11.353030933000001]
[13,13,"2026-07-10",7,{"$f":"IF(ISERROR(MATCH(D16,Simulador!$H$16:$H$17,0))=FALSE,\"C\",IF(ISERROR(MATCH(D16,Simulador!$H$18:$H$19,0))=FALSE,\"D\",\"\"))","v":""},{"$f":"IF(E16=\"C\",0,IF(E16 =\"D\",ROUND(1/((1+Simulador!$Q$13)^A16),9) * 2,ROUND(1/((1+Simulador!$Q$13)^A16),9)))","v":0.894291159},12.247322092000001]
[14,14,"2026-08-10",8,{"$f":"IF(ISERROR(MATCH(D17,Simulador!$H$16:$H$17,0))=FALSE,\"C\",IF(ISERROR(MATCH(D17,Simulador!$H$18:$H$19,0))=FALSE,\"D\",\"\"))","v":""},{"$f":"IF(E17=\"C\",0,IF(E17 =\"D\",ROUND(1/((1+Simulador!$Q$13)^A17),9) * 2,ROUND(1/((1+Simulador!$Q$13)^A17),9)))","v":0.88663842299999995},13.133960515000002]
[15,15,"2026-09-10",9,{"$f":"IF(ISERROR(MATCH(D18,Simulador!$H$16:$H$17,0))=FALSE,\"C\",IF(ISERROR(MATCH(D18,Simulador!$H$18:$H$19,0))=FALSE,\"D\",\"\"))","v":""},{"$f":"IF(E18=\"C\",0,IF(E18 =\"D\",ROUND(1/((1+Simulador!$Q$13)^A18),9) * 2,ROUND(1/((1+Simulador!$Q$13)^A18),9)))","v":0.87905117399999999},14.013011689000002]
[16,16,"2026-10-10",10,{"$f":"IF(ISERROR(MATCH(D19,Simulador!$H$16:$H$17,0))=FALSE,\"C\",IF(ISERROR(MATCH(D19,Simulador!$H$18:$H$19,0))=FALSE,\"D\",\"\"))","v":""},{"$f":"IF(E19=\"C\",0,IF(E19 =\"D\",ROUND(1/((1+Simulador!$Q$13)^A19),9) * 2,ROUND(1/((1+Simulador!$Q$13)^A19),9)))","v":0.87152885099999999},14.884540540000003]
[17,17,"2026-11-10",11,{"$f":"IF(ISERROR(MATCH(D20,Simulador!$H$16:$H$17,0))=FALSE,\"C\",IF(ISERROR(MATCH(D20,Simulador!$H$18:$H$19,0))=FALSE,\"D\",\"\"))","v":""},{"$f":"IF(E20=\"C\",0,IF(E20 =\"D\",ROUND(1/((1+Simulador!$Q$13)^A20),9) * 2,ROUND(1/((1+Simulador!$Q$13)^A20),9)))","v":0.86407089999999998},15.748611440000003]
{"$rows_left_out":366}