{"text_format":"1","workbook":"xlsx","n_sheets":6,"sheets":["Simulador Credito Hipotecario","Hoja1","Cronograma","Simulador CHIP Final","Calculos CHIP","Parametros"],"not_rendered":{"charts":0,"images":16,"macros":1,"external_links":0,"defined_names":2,"comments":1,"pivot_tables":0},"unopened":[],"bounds":{"document_bytes":16777216,"sheet_cells":100000,"rows_first":2000,"rows_last":500,"rows_between":2000,"halvings":0,"cell_chars":16384,"cell_head_chars":4096},"cells_cut":0,"cells_raw":0,"read":"whole","date_system":"1900"}

{"sheet":"Simulador Credito Hipotecario","index":0,"n_rows":47,"n_cols":8,"rows_kept":47,"cut":false,"hidden":false,"merged":[[46,0,49,8],[41,3,41,5],[12,3,12,5],[13,3,13,5],[4,3,4,5],[15,3,15,5],[11,3,11,5],[20,3,20,5],[40,3,40,5],[42,3,42,5],[30,3,30,5],[31,3,31,5],[24,3,24,5],[9,3,9,5],[3,3,3,5],[6,3,6,5],[7,3,7,5],[8,3,8,5],[10,3,10,5],[1,1,1,7],[33,3,33,5],[35,3,35,5],[14,3,14,5],[29,3,29,5],[19,3,19,5],[23,3,23,5],[22,3,22,5],[21,3,21,5],[26,3,26,5],[25,3,25,5],[27,3,27,5],[18,3,18,5],[28,3,28,5],[16,3,16,5],[17,3,17,5]]}
[]
[null,"SIMULADOR CRÉDITO HIPOTECARIO"]
[]
[null,"  Moneda"]
[null,"  Producto"]
[]
[null,"  Fecha de solicitud",null,"2025-01-14",null,null,"(dd/mm/aaaa)"]
[null,"  Plazo en meses",null,0]
[null,"  Días de Gracia",null,0]
[]
[null,"  Fecha de vencimiento (1° cuota)",null,"2025-02-14"]
[null,"  Cuota de Interés por periodo de gracia",null,0]
[null,"  Valor del bien (inmueble)",null,0]
[null,"  Valor Comercial / Valor Reconstrucción ",null,0]
[null,"  Cuota Inicial",null,0]
[]
[]
[]
[]
[null,"  Monto del préstamo",null,0]
[null,"  Gastos Previos",null,0]
[]
[]
[null,"  Monto financiamento total",null,0]
[]
[null,"  Tasa de interés efectiva anual % (base a 360 días) fija.",null,0]
[null,"  Tipo de seguro de desgravamen"]
[null,"  Tasa mensual de seguro de desgravamen",null,0]
[null,"  Tipo de seguro de inmueble",null,"SEGURO TODO RIESGO (*) "]
[null,"  Tasa mensual de seguro Todo Riesgo",null,0]
{"$rows_left_out":18}
{"sheet":"Hoja1","index":1,"n_rows":0,"n_cols":0,"rows_kept":0,"cut":false,"hidden":true,"merged":[]}

{"sheet":"Cronograma","index":2,"n_rows":308,"n_cols":11,"rows_kept":308,"cut":false,"hidden":false,"merged":[[1,1,1,10],[2,1,3,10],[5,1,5,3],[0,1,0,10]]}
[]
[null,"SIMULADOR CRÉDITO HIPOTECARIO"]
[null,"NOTA: Todo crédito se encuentra sujeto a evaluación crediticia del Banco, quien determina el monto y plazo a otorgar. Este documento ha sido emitido en base a la información proporcionada por el cliente y tiene carácter referencial"]
[]
[null,null,null,null,"Amortización","Interés","Cuota de Gracia","Com. Envío Inf. Perio.","Seguro Desgravamen","Seguro Todo Riesgo","Cuota"]
[null,"    TOTALES A PAGAR",null,null,199000.28000015041,327649.25999999983,0,0,19684.960000000025,22175.999999999876,568510.50000014959]
[]
[null,"Nº","Fecha de Pago","Saldo Capital","Amortización","Interés","Cuota de Gracia","Com. Envío Inf. Perio.","Seguro Desgravamen","Seguro Todo Riesgo","Cuota"]
[null,1,"2025-02-14",199000,119.05500000050147,1608.53,0,0,93.53,73.92,1895.0350000005014]
[null,2,"2025-03-14",198880.95,282.44500000050135,1451.43,0,0,87.24,73.92,1895.0350000005014]
[null,3,"2025-04-14",198598.51,119.38500000050148,1605.28,0,0,96.45,73.92,1895.0350000005017]
[null,4,"2025-05-14",198479.13,175.4650000005015,1552.36,0,0,93.29,73.92,1895.0350000005014]
[null,5,"2025-06-14",198303.67,121.90500000050135,1602.9,0,0,96.31,73.92,1895.0350000005014]
[null,6,"2025-07-14",198181.77,177.92500000050148,1550.04,0,0,93.15,73.92,1895.0350000005017]
[null,7,"2025-08-14",198003.84,124.47500000050142,1600.48,0,0,96.16,73.92,1895.0350000005017]
[null,8,"2025-09-14",197879.36,125.54500000050142,1599.47,0,0,96.1,73.92,1895.0350000005014]
[null,9,"2025-10-14",197753.81,181.48500000050137,1546.69,0,0,92.94,73.92,1895.0350000005014]
[null,10,"2025-11-14",197572.32,128.17500000050143,1596.99,0,0,95.95,73.92,1895.0350000005017]
[null,11,"2025-12-14",197444.14,184.04500000050143,1544.27,0,0,92.8,73.92,1895.0350000005014]
[null,12,"2026-01-14",197260.1,130.85500000050138,1594.46,0,0,95.8,73.92,1895.0350000005014]
[null,13,"2026-02-14",197129.25,131.96500000050133,1593.41,0,0,95.74,73.92,1895.0350000005014]
[null,14,"2026-03-14",196997.29,297.01500000050135,1437.68,0,0,86.42,73.92,1895.0350000005014]
[null,15,"2026-04-14",196700.27,135.6450000005014,1589.94,0,0,95.53,73.92,1895.0350000005014]
[null,16,"2026-05-14",196564.62,191.33500000050134,1537.39,0,0,92.39,73.92,1895.0350000005017]
[null,17,"2026-06-14",196373.28,138.44500000050147,1587.3,0,0,95.37,73.92,1895.0350000005014]
[null,18,"2026-07-14",196234.83,194.07500000050146,1534.81,0,0,92.23,73.92,1895.0350000005014]
[null,19,"2026-08-14",196040.75,141.29500000050155,1584.61,0,0,95.21,73.92,1895.0350000005014]
[null,20,"2026-09-14",195899.45,142.50500000050141,1583.47,0,0,95.14,73.92,1895.0350000005017]
[null,21,"2026-10-14",195756.95,198.0350000005015,1531.07,0,0,92.01,73.92,1895.0350000005014]
[null,22,"2026-11-14",195558.92,145.42500000050137,1580.71,0,0,94.98,73.92,1895.0350000005014]
{"$rows_left_out":279}
{"sheet":"Simulador CHIP Final","index":3,"n_rows":336,"n_cols":47,"rows_kept":336,"cut":false,"hidden":true,"merged":[[31,37,31,38],[28,17,28,18],[1,2,1,24],[28,14,28,15]]}
[]
[null,null,"SIMULADOR DE CUOTAS - CRÉDITO HIPOTECARIO"]
[]
[]
[null,null,"Importe Solicitado",null,null,null,null,{"$f":"'Simulador Credito Hipotecario'!D24","v":0},null,null,null,"Fecha Desembolso",null,null,null,null,{"$f":"'Simulador Credito Hipotecario'!D7","v":"2025-01-14"}]
[null,null,"Saldo de Capital",null,null,null,null,{"$f":"H5","v":0},null,null,null,"Fecha Final de Gracia",null,null,null,null,{"$f":"+Q5+H15","v":"2025-01-14"}]
[null,null,"Saldo de Interes",null,null,null,null,0,null,null,null,"Fecha de la 1° cuota",null,null,null,null,{"$f":"DATE(YEAR(EDATE(Q6,1)),MONTH(EDATE(Q6,1)),DAY(EDATE(Q6,1)))","v":"2025-02-14"}]
[null,null,"Tasa Anual (TEA)",null,null,null,null,{"$f":"'Simulador Credito Hipotecario'!D26","v":0},null,null,null,"Fecha final de vencimiento",null,null,null,null,{"$f":"IF(OR($H$16>0,$H$17>0),VLOOKUP($H$14,$A$33:$C$332,3,0),DATE(YEAR(EDATE(Q6,H14)),MONTH(EDATE(Q6,H14)),DAY(EDATE(Q6,H14))))","v":"2025-01-14"}]
[null,null,"Tasa de Seguro de Desgravámen",null,null,null,null,{"$f":"'Simulador Credito Hipotecario'!D28","v":0},null,null,null,"Base",null,null,null,null,360]
[null,null,"Tasa Anual (TEA) - Ajustada",null,null,null,null,{"$f":"+H8","v":0},null,null,null,"Frecuencia pago en días",null,null,null,null,30]
[null,null,"Comision por Env. Inf",null,null,null,null,{"$f":"'Simulador Credito Hipotecario'!D32","v":0},null,null,null,"Tasa Equivalente - Ajustada",null,null,null,null,{"$f":"ROUND((((H10/100+1)^(1/(Q9/Q10))-1)*Q9/Q10)*100,6)","v":0},"tea conv. A tem luego nominal anual"]
[null,null,"Valor Asegurable",null,null,null,null,{"$f":"'Simulador Credito Hipotecario'!D14","v":0},null,2.1000000000000001E-4,null,"Días entre cuotas",null,null,null,null,{"$f":"(Q8-Q6)/H14","v":{"$error":"#DIV/0!"}},"dias promedio entre cuotas"]
[null,null,"Tasa de Seguro Todo Riesgo",null,null,null,null,{"$f":"'Simulador Credito Hipotecario'!D30","v":0},{"$f":"+H13*12","v":0},{"$f":"+I13/365*30*H12","v":0},null,"Factor Aplicado - Ajustada",null,null,null,null,{"$f":"ROUND(($Q$11/100)/($Q$9/$Q$12),8)","v":{"$error":"#DIV/0!"}},"tem convertida de manera nominal a los dias entre cuotas"]
[null,null,"Plazo y  Nro. Cuotas",null,null,null,null,{"$f":"'Simulador Credito Hipotecario'!D8","v":0},{"$f":"H14","v":0},null,null,"Factor Aplicado para la cuota - Ajustada",null,null,null,null,{"$f":"1/((1-((1+$Q$13)^(-1*$H$14)))/$Q$13)","v":{"$error":"#DIV/0!"}},"Factor de cuota (ok)"]
[null,null,"Días de Gracia",null,null,null,null,{"$f":"'Simulador Credito Hipotecario'!D9","v":0},null,null,null,"Interes de Gracia  (Se considera la TEA Normal)",null,null,null,null,{"$f":"IF(H15>0,ROUND(H6*(((1+H8/100)^(ABS(H15)/Q9))-1),4),ROUND(H6*(((1+H8/100)^(ABS(H15)/Q9))-1),4) * -1)","v":0},"Ok"]
[null,null,"Mes de No Pago 1",null,null,null,null,0,null,{"$f":"15*12","v":180},null,"Saldo Interes +/- Interes Gracia",null,null,null,null,{"$f":"IF(H7 + Q15>0,H7+ Q15,0)","v":0}]
[null,null,"Mes de No Pago 2",null,null,null,null,0,null,null,null,"Seg Desg de Gracia",null,null,null,null,{"$f":"IF(H15>0,ROUNDDOWN(H5*H9/30*H15,2),ROUNDDOWN(H5*H9/30*H15,2)*0)","v":0}]
[null,null,"Mes Cuota Doble 1",null,null,null,null,0,null,null,null,"TCEA",null,null,null,null,{"$f":"+$AJ$31","v":{"$error":"#DIV/0!"}}]
[null,null,"Mes Cuota Doble 2",null,null,null," ",0]
[]
[null,null,null,null,null,null,null,null,null,null,null,null,null,null,"Suavización",null,null,null,null,null,"Validador Cuota Doble"]
[null,null,null,null,null,null,null,null,null,null,null,null,null,null,"Ultimo saldo de Principal",null,{"$f":"VLOOKUP(I14,$F$32:$Y$332,20,FALSE)","v":{"$error":"#N/A"}},null,null,null,"Cuota Simple",null,{"$f":"+VLOOKUP(\"\",$D$33:$X$332,21,0)","v":{"$error":"#DIV/0!"}}]
[null,null,null,null,null,"Valor de cuota por dias de gracia",null,null,null,{"$f":"$Q$16/(($I$14+COUNTIF(D33:INDIRECT(CONCATENATE(\"C\",33+I14-1)),\"D\"))*(1/((1+0)^($Q$10/$Q$9))))","v":{"$error":"#DIV/0!"}},{"$f":"Q16/SUM(AP33:INDIRECT(CONCATENATE(\"AE\",32+I14-1)))","v":{"$error":"#DIV/0!"}},null,null,null,"Numero de Dias (Calculo Factor Ajuste)",null,{"$f":"Q8-Q6+SUMIF($D$33:$D$332,\"D\",$I$33:$I$332)+(Q8-Q6+SUMIF($D$33:$D$332,\"D\",$I$33:$I$332))/2","v":0},null,null,null,"Cuota Doble",null,{"$f":"+IFERROR(VLOOKUP(\"D\",$D$33:$X$332,21,0),\" \")","v":" "}]
[null,null,null,null,null,"Valor de cuota por capital",null,null,null,{"$f":"ROUND(IF(OR(H16 + H17 > 0,H18 + H19>0), ROUND(H6/VLOOKUP(H14,'Calculos CHIP'!$A$3:$G$303,7,FALSE),2),H6*$Q$14),2)+Q33+R33+S33+W33","v":{"$error":"#DIV/0!"}},{"$f":"J24+Q29","v":{"$error":"#DIV/0!"}},null,null,null,"Valor de Cuota Nivelada",null,{"$f":"ROUND(+Q22/ROUND(1*(((1+H10/100)^(Q23/Q9))-1),4),2)","v":{"$error":"#N/A"}},null,null,null,"Factor",null,{"$f":"+IFERROR(W23/W22,\" \")","v":" "},null,null,null,null,null,null,null,null,null,null,null,null,null,null,"RANGO DES.","INCRE. AJUSTE"]
[null,null,null,null,null,"Valor de Seg Desg por dia de gracia",null,null,null,{"$f":"$Q$17/(($I$14+COUNTIF(D33:INDIRECT(CONCATENATE(\"C\",32+I14-1)),\"D\"))*(1/((1+0)^($Q$10/$Q$9))))","v":{"$error":"#DIV/0!"}},null,null,null,null,null,null,null,null,null,null,null,null,null,null,null,null,null,null,null,null,null,null,null,null,null,null,null,"<100K",5.0000000000000001E-3]
[null,null,null,null,null,"Seguro de Desgravamen (FPF)",null,null,null,{"$f":"ROUNDDOWN($H$5*$H$9,2)","v":0},null,null,null,null,"Factor Ajuste",null,{"$f":"Q24*Q14","v":{"$error":"#N/A"}},null,"Se copia LO DEL COSTADO  a partir de la primera corrida",null,"Calce de Capital",null,null,null,null,null,null,null,null,null,null,null,null,null,null,null,null,">=100K<200K",2E-3]
[null,null,null,null,null,"Comision por Env.Inf",null,null,null,{"$f":"+H11","v":0},null,null,null,null,"Exceso de Int + Gracia",null,{"$f":"SUM(Z33:Z332)","v":0},{"$f":"ROUND(IF(OR(H16+ H17> 0,H18 + H19>0),ROUNDUP($Q$27/VLOOKUP(H14,'Calculos CHIP'!$A$3:$G$303,7,FALSE),2),$Q$27*$Q$14),2)","v":{"$error":"#DIV/0!"}},0,null,"Suma Capital (K)",null,{"$f":"+SUM($K$33:$K$332)","v":{"$error":"#DIV/0!"}},null,null,null,null,null,null,null,null,null,null,null,null,null,null,">=200K<300K",1.9E-3]
[null,null,null,null,null,"Seguro Todo Riesgo",null,null,null,{"$f":"ROUND($H$12*$H$13,2)","v":0},null,null,null,null,"Factor Ajuste 2",null,{"$f":"+Q22/(H14+COUNTIF(D33:$D$332,\"D\"))","v":{"$error":"#N/A"}},null,null,null,"Validador",null,{"$f":"+$H$5-W27","v":{"$error":"#DIV/0!"}},"<- El valor tiene que ser cercano a cero.",null,null,null,null,null,null,null,null,null,null,null,null,null,">=300K",1.5E-3]
[null,null,null,null,null,"Cuota",null,null,null,{"$f":"+J24","v":{"$error":"#DIV/0!"}},null,null,null,null,"Digite Factor de Ajuste Anterior  mas El Actual",null,-14.134999999498667,"Se actualiza en cada simulación (Validar que la celda W28 sea cercano a cero)"]
[null,null,null,null,null,null,null,null,null,null,null,null,null,null,null,null,"."]
{"$rows_left_out":307}
{"sheet":"Calculos CHIP","index":4,"n_rows":303,"n_cols":7,"rows_kept":303,"cut":false,"hidden":true,"merged":[[0,0,0,6]]}
["Factores utilizados en Meses de No Pago para cálculo del valor cuota"]
[]
["N° de Cuota","Equivalente","Fecha","Mes","Marca Cuota No Pago","Factor (10)","Acumulado"]
[1,{"$f":"IF(E4<>\"C\",IF(ISERROR(1+B3)=TRUE,1,1+B3),IF(ISNUMBER(B3),B3,1))","v":1},{"$f":"+'Simulador CHIP Final'!Q7","v":"2025-02-14"},{"$f":"MONTH(C4)","v":2},{"$f":"IF(ISERROR(MATCH(D4,'Simulador CHIP Final'!$H$16:$H$17,0))=FALSE,\"C\",IF(ISERROR(MATCH(D4,'Simulador CHIP Final'!$H$18:$H$19,0))=FALSE,\"D\",\"\"))","v":""},{"$f":"IF(E4=\"C\",0,IF(E4 =\"D\",ROUND(1/((1+'Simulador CHIP Final'!$Q$13)^A4),9) * 2,ROUND(1/((1+'Simulador CHIP Final'!$Q$13)^A4),9)))","v":{"$error":"#DIV/0!"}},{"$f":"ROUND(F4,9)","v":{"$error":"#DIV/0!"}}]
[{"$f":"A4+1","v":2},{"$f":"IF(E5<>\"C\",IF(ISERROR(1+B4)=TRUE,1,1+B4),IF(ISNUMBER(B4),B4,1))","v":2},{"$f":"DATE(YEAR(C4) + 1/12,MONTH(C4)+1,DAY(C4))","v":"2025-03-14"},3,{"$f":"IF(ISERROR(MATCH(D5,'Simulador CHIP Final'!$H$16:$H$17,0))=FALSE,\"C\",IF(ISERROR(MATCH(D5,'Simulador CHIP Final'!$H$18:$H$19,0))=FALSE,\"D\",\"\"))","v":""},{"$f":"IF(E5=\"C\",0,IF(E5 =\"D\",ROUND(1/((1+'Simulador CHIP Final'!$Q$13)^A5),9) * 2,ROUND(1/((1+'Simulador CHIP Final'!$Q$13)^A5),9)))","v":{"$error":"#DIV/0!"}},{"$f":"G4+ROUND(F5,9)","v":{"$error":"#DIV/0!"}}]
[3,3,{"$f":"DATE(YEAR(C5) + 1/12,MONTH(C5)+1,DAY(C5))","v":"2025-04-14"},4,{"$f":"IF(ISERROR(MATCH(D6,'Simulador CHIP Final'!$H$16:$H$17,0))=FALSE,\"C\",IF(ISERROR(MATCH(D6,'Simulador CHIP Final'!$H$18:$H$19,0))=FALSE,\"D\",\"\"))","v":""},{"$f":"IF(E6=\"C\",0,IF(E6 =\"D\",ROUND(1/((1+'Simulador CHIP Final'!$Q$13)^A6),9) * 2,ROUND(1/((1+'Simulador CHIP Final'!$Q$13)^A6),9)))","v":{"$error":"#DIV/0!"}},{"$f":"G5+ROUND(F6,9)","v":{"$error":"#DIV/0!"}}]
[4,4,"2025-05-14",5,{"$f":"IF(ISERROR(MATCH(D7,'Simulador CHIP Final'!$H$16:$H$17,0))=FALSE,\"C\",IF(ISERROR(MATCH(D7,'Simulador CHIP Final'!$H$18:$H$19,0))=FALSE,\"D\",\"\"))","v":""},{"$f":"IF(E7=\"C\",0,IF(E7 =\"D\",ROUND(1/((1+'Simulador CHIP Final'!$Q$13)^A7),9) * 2,ROUND(1/((1+'Simulador CHIP Final'!$Q$13)^A7),9)))","v":{"$error":"#DIV/0!"}},{"$error":"#DIV/0!"}]
[5,5,"2025-06-14",6,{"$f":"IF(ISERROR(MATCH(D8,'Simulador CHIP Final'!$H$16:$H$17,0))=FALSE,\"C\",IF(ISERROR(MATCH(D8,'Simulador CHIP Final'!$H$18:$H$19,0))=FALSE,\"D\",\"\"))","v":""},{"$f":"IF(E8=\"C\",0,IF(E8 =\"D\",ROUND(1/((1+'Simulador CHIP Final'!$Q$13)^A8),9) * 2,ROUND(1/((1+'Simulador CHIP Final'!$Q$13)^A8),9)))","v":{"$error":"#DIV/0!"}},{"$error":"#DIV/0!"}]
[6,6,"2025-07-14",7,{"$f":"IF(ISERROR(MATCH(D9,'Simulador CHIP Final'!$H$16:$H$17,0))=FALSE,\"C\",IF(ISERROR(MATCH(D9,'Simulador CHIP Final'!$H$18:$H$19,0))=FALSE,\"D\",\"\"))","v":""},{"$f":"IF(E9=\"C\",0,IF(E9 =\"D\",ROUND(1/((1+'Simulador CHIP Final'!$Q$13)^A9),9) * 2,ROUND(1/((1+'Simulador CHIP Final'!$Q$13)^A9),9)))","v":{"$error":"#DIV/0!"}},{"$error":"#DIV/0!"}]
[7,7,"2025-08-14",8,{"$f":"IF(ISERROR(MATCH(D10,'Simulador CHIP Final'!$H$16:$H$17,0))=FALSE,\"C\",IF(ISERROR(MATCH(D10,'Simulador CHIP Final'!$H$18:$H$19,0))=FALSE,\"D\",\"\"))","v":""},{"$f":"IF(E10=\"C\",0,IF(E10 =\"D\",ROUND(1/((1+'Simulador CHIP Final'!$Q$13)^A10),9) * 2,ROUND(1/((1+'Simulador CHIP Final'!$Q$13)^A10),9)))","v":{"$error":"#DIV/0!"}},{"$error":"#DIV/0!"}]
[8,8,"2025-09-14",9,{"$f":"IF(ISERROR(MATCH(D11,'Simulador CHIP Final'!$H$16:$H$17,0))=FALSE,\"C\",IF(ISERROR(MATCH(D11,'Simulador CHIP Final'!$H$18:$H$19,0))=FALSE,\"D\",\"\"))","v":""},{"$f":"IF(E11=\"C\",0,IF(E11 =\"D\",ROUND(1/((1+'Simulador CHIP Final'!$Q$13)^A11),9) * 2,ROUND(1/((1+'Simulador CHIP Final'!$Q$13)^A11),9)))","v":{"$error":"#DIV/0!"}},{"$error":"#DIV/0!"}]
[9,9,"2025-10-14",10,{"$f":"IF(ISERROR(MATCH(D12,'Simulador CHIP Final'!$H$16:$H$17,0))=FALSE,\"C\",IF(ISERROR(MATCH(D12,'Simulador CHIP Final'!$H$18:$H$19,0))=FALSE,\"D\",\"\"))","v":""},{"$f":"IF(E12=\"C\",0,IF(E12 =\"D\",ROUND(1/((1+'Simulador CHIP Final'!$Q$13)^A12),9) * 2,ROUND(1/((1+'Simulador CHIP Final'!$Q$13)^A12),9)))","v":{"$error":"#DIV/0!"}},{"$error":"#DIV/0!"}]
[10,10,"2025-11-14",11,{"$f":"IF(ISERROR(MATCH(D13,'Simulador CHIP Final'!$H$16:$H$17,0))=FALSE,\"C\",IF(ISERROR(MATCH(D13,'Simulador CHIP Final'!$H$18:$H$19,0))=FALSE,\"D\",\"\"))","v":""},{"$f":"IF(E13=\"C\",0,IF(E13 =\"D\",ROUND(1/((1+'Simulador CHIP Final'!$Q$13)^A13),9) * 2,ROUND(1/((1+'Simulador CHIP Final'!$Q$13)^A13),9)))","v":{"$error":"#DIV/0!"}},{"$error":"#DIV/0!"}]
[11,11,"2025-12-14",12,{"$f":"IF(ISERROR(MATCH(D14,'Simulador CHIP Final'!$H$16:$H$17,0))=FALSE,\"C\",IF(ISERROR(MATCH(D14,'Simulador CHIP Final'!$H$18:$H$19,0))=FALSE,\"D\",\"\"))","v":""},{"$f":"IF(E14=\"C\",0,IF(E14 =\"D\",ROUND(1/((1+'Simulador CHIP Final'!$Q$13)^A14),9) * 2,ROUND(1/((1+'Simulador CHIP Final'!$Q$13)^A14),9)))","v":{"$error":"#DIV/0!"}},{"$error":"#DIV/0!"}]
[12,12,"2026-01-14",1,{"$f":"IF(ISERROR(MATCH(D15,'Simulador CHIP Final'!$H$16:$H$17,0))=FALSE,\"C\",IF(ISERROR(MATCH(D15,'Simulador CHIP Final'!$H$18:$H$19,0))=FALSE,\"D\",\"\"))","v":""},{"$f":"IF(E15=\"C\",0,IF(E15 =\"D\",ROUND(1/((1+'Simulador CHIP Final'!$Q$13)^A15),9) * 2,ROUND(1/((1+'Simulador CHIP Final'!$Q$13)^A15),9)))","v":{"$error":"#DIV/0!"}},{"$error":"#DIV/0!"}]
[13,13,"2026-02-14",2,{"$f":"IF(ISERROR(MATCH(D16,'Simulador CHIP Final'!$H$16:$H$17,0))=FALSE,\"C\",IF(ISERROR(MATCH(D16,'Simulador CHIP Final'!$H$18:$H$19,0))=FALSE,\"D\",\"\"))","v":""},{"$f":"IF(E16=\"C\",0,IF(E16 =\"D\",ROUND(1/((1+'Simulador CHIP Final'!$Q$13)^A16),9) * 2,ROUND(1/((1+'Simulador CHIP Final'!$Q$13)^A16),9)))","v":{"$error":"#DIV/0!"}},{"$error":"#DIV/0!"}]
[14,14,"2026-03-14",3,{"$f":"IF(ISERROR(MATCH(D17,'Simulador CHIP Final'!$H$16:$H$17,0))=FALSE,\"C\",IF(ISERROR(MATCH(D17,'Simulador CHIP Final'!$H$18:$H$19,0))=FALSE,\"D\",\"\"))","v":""},{"$f":"IF(E17=\"C\",0,IF(E17 =\"D\",ROUND(1/((1+'Simulador CHIP Final'!$Q$13)^A17),9) * 2,ROUND(1/((1+'Simulador CHIP Final'!$Q$13)^A17),9)))","v":{"$error":"#DIV/0!"}},{"$error":"#DIV/0!"}]
[15,15,"2026-04-14",4,{"$f":"IF(ISERROR(MATCH(D18,'Simulador CHIP Final'!$H$16:$H$17,0))=FALSE,\"C\",IF(ISERROR(MATCH(D18,'Simulador CHIP Final'!$H$18:$H$19,0))=FALSE,\"D\",\"\"))","v":""},{"$f":"IF(E18=\"C\",0,IF(E18 =\"D\",ROUND(1/((1+'Simulador CHIP Final'!$Q$13)^A18),9) * 2,ROUND(1/((1+'Simulador CHIP Final'!$Q$13)^A18),9)))","v":{"$error":"#DIV/0!"}},{"$error":"#DIV/0!"}]
[16,16,"2026-05-14",5,{"$f":"IF(ISERROR(MATCH(D19,'Simulador CHIP Final'!$H$16:$H$17,0))=FALSE,\"C\",IF(ISERROR(MATCH(D19,'Simulador CHIP Final'!$H$18:$H$19,0))=FALSE,\"D\",\"\"))","v":""},{"$f":"IF(E19=\"C\",0,IF(E19 =\"D\",ROUND(1/((1+'Simulador CHIP Final'!$Q$13)^A19),9) * 2,ROUND(1/((1+'Simulador CHIP Final'!$Q$13)^A19),9)))","v":{"$error":"#DIV/0!"}},{"$error":"#DIV/0!"}]
[17,17,"2026-06-14",6,{"$f":"IF(ISERROR(MATCH(D20,'Simulador CHIP Final'!$H$16:$H$17,0))=FALSE,\"C\",IF(ISERROR(MATCH(D20,'Simulador CHIP Final'!$H$18:$H$19,0))=FALSE,\"D\",\"\"))","v":""},{"$f":"IF(E20=\"C\",0,IF(E20 =\"D\",ROUND(1/((1+'Simulador CHIP Final'!$Q$13)^A20),9) * 2,ROUND(1/((1+'Simulador CHIP Final'!$Q$13)^A20),9)))","v":{"$error":"#DIV/0!"}},{"$error":"#DIV/0!"}]
[18,18,"2026-07-14",7,{"$f":"IF(ISERROR(MATCH(D21,'Simulador CHIP Final'!$H$16:$H$17,0))=FALSE,\"C\",IF(ISERROR(MATCH(D21,'Simulador CHIP Final'!$H$18:$H$19,0))=FALSE,\"D\",\"\"))","v":""},{"$f":"IF(E21=\"C\",0,IF(E21 =\"D\",ROUND(1/((1+'Simulador CHIP Final'!$Q$13)^A21),9) * 2,ROUND(1/((1+'Simulador CHIP Final'!$Q$13)^A21),9)))","v":{"$error":"#DIV/0!"}},{"$error":"#DIV/0!"}]
[19,19,"2026-08-14",8,{"$f":"IF(ISERROR(MATCH(D22,'Simulador CHIP Final'!$H$16:$H$17,0))=FALSE,\"C\",IF(ISERROR(MATCH(D22,'Simulador CHIP Final'!$H$18:$H$19,0))=FALSE,\"D\",\"\"))","v":""},{"$f":"IF(E22=\"C\",0,IF(E22 =\"D\",ROUND(1/((1+'Simulador CHIP Final'!$Q$13)^A22),9) * 2,ROUND(1/((1+'Simulador CHIP Final'!$Q$13)^A22),9)))","v":{"$error":"#DIV/0!"}},{"$error":"#DIV/0!"}]
[20,20,"2026-09-14",9,{"$f":"IF(ISERROR(MATCH(D23,'Simulador CHIP Final'!$H$16:$H$17,0))=FALSE,\"C\",IF(ISERROR(MATCH(D23,'Simulador CHIP Final'!$H$18:$H$19,0))=FALSE,\"D\",\"\"))","v":""},{"$f":"IF(E23=\"C\",0,IF(E23 =\"D\",ROUND(1/((1+'Simulador CHIP Final'!$Q$13)^A23),9) * 2,ROUND(1/((1+'Simulador CHIP Final'!$Q$13)^A23),9)))","v":{"$error":"#DIV/0!"}},{"$error":"#DIV/0!"}]
[21,21,"2026-10-14",10,{"$f":"IF(ISERROR(MATCH(D24,'Simulador CHIP Final'!$H$16:$H$17,0))=FALSE,\"C\",IF(ISERROR(MATCH(D24,'Simulador CHIP Final'!$H$18:$H$19,0))=FALSE,\"D\",\"\"))","v":""},{"$f":"IF(E24=\"C\",0,IF(E24 =\"D\",ROUND(1/((1+'Simulador CHIP Final'!$Q$13)^A24),9) * 2,ROUND(1/((1+'Simulador CHIP Final'!$Q$13)^A24),9)))","v":{"$error":"#DIV/0!"}},{"$error":"#DIV/0!"}]
[22,22,"2026-11-14",11,{"$f":"IF(ISERROR(MATCH(D25,'Simulador CHIP Final'!$H$16:$H$17,0))=FALSE,\"C\",IF(ISERROR(MATCH(D25,'Simulador CHIP Final'!$H$18:$H$19,0))=FALSE,\"D\",\"\"))","v":""},{"$f":"IF(E25=\"C\",0,IF(E25 =\"D\",ROUND(1/((1+'Simulador CHIP Final'!$Q$13)^A25),9) * 2,ROUND(1/((1+'Simulador CHIP Final'!$Q$13)^A25),9)))","v":{"$error":"#DIV/0!"}},{"$error":"#DIV/0!"}]
[23,23,"2026-12-14",12,{"$f":"IF(ISERROR(MATCH(D26,'Simulador CHIP Final'!$H$16:$H$17,0))=FALSE,\"C\",IF(ISERROR(MATCH(D26,'Simulador CHIP Final'!$H$18:$H$19,0))=FALSE,\"D\",\"\"))","v":""},{"$f":"IF(E26=\"C\",0,IF(E26 =\"D\",ROUND(1/((1+'Simulador CHIP Final'!$Q$13)^A26),9) * 2,ROUND(1/((1+'Simulador CHIP Final'!$Q$13)^A26),9)))","v":{"$error":"#DIV/0!"}},{"$error":"#DIV/0!"}]
[24,24,"2027-01-14",1,{"$f":"IF(ISERROR(MATCH(D27,'Simulador CHIP Final'!$H$16:$H$17,0))=FALSE,\"C\",IF(ISERROR(MATCH(D27,'Simulador CHIP Final'!$H$18:$H$19,0))=FALSE,\"D\",\"\"))","v":""},{"$f":"IF(E27=\"C\",0,IF(E27 =\"D\",ROUND(1/((1+'Simulador CHIP Final'!$Q$13)^A27),9) * 2,ROUND(1/((1+'Simulador CHIP Final'!$Q$13)^A27),9)))","v":{"$error":"#DIV/0!"}},{"$error":"#DIV/0!"}]
[25,25,"2027-02-14",2,{"$f":"IF(ISERROR(MATCH(D28,'Simulador CHIP Final'!$H$16:$H$17,0))=FALSE,\"C\",IF(ISERROR(MATCH(D28,'Simulador CHIP Final'!$H$18:$H$19,0))=FALSE,\"D\",\"\"))","v":""},{"$f":"IF(E28=\"C\",0,IF(E28 =\"D\",ROUND(1/((1+'Simulador CHIP Final'!$Q$13)^A28),9) * 2,ROUND(1/((1+'Simulador CHIP Final'!$Q$13)^A28),9)))","v":{"$error":"#DIV/0!"}},{"$error":"#DIV/0!"}]
[26,26,"2027-03-14",3,{"$f":"IF(ISERROR(MATCH(D29,'Simulador CHIP Final'!$H$16:$H$17,0))=FALSE,\"C\",IF(ISERROR(MATCH(D29,'Simulador CHIP Final'!$H$18:$H$19,0))=FALSE,\"D\",\"\"))","v":""},{"$f":"IF(E29=\"C\",0,IF(E29 =\"D\",ROUND(1/((1+'Simulador CHIP Final'!$Q$13)^A29),9) * 2,ROUND(1/((1+'Simulador CHIP Final'!$Q$13)^A29),9)))","v":{"$error":"#DIV/0!"}},{"$error":"#DIV/0!"}]
[27,27,"2027-04-14",4,{"$f":"IF(ISERROR(MATCH(D30,'Simulador CHIP Final'!$H$16:$H$17,0))=FALSE,\"C\",IF(ISERROR(MATCH(D30,'Simulador CHIP Final'!$H$18:$H$19,0))=FALSE,\"D\",\"\"))","v":""},{"$f":"IF(E30=\"C\",0,IF(E30 =\"D\",ROUND(1/((1+'Simulador CHIP Final'!$Q$13)^A30),9) * 2,ROUND(1/((1+'Simulador CHIP Final'!$Q$13)^A30),9)))","v":{"$error":"#DIV/0!"}},{"$error":"#DIV/0!"}]
{"$rows_left_out":274}
{"sheet":"Parametros","index":5,"n_rows":45,"n_cols":19,"rows_kept":45,"cut":false,"hidden":true,"merged":[[31,1,31,2],[38,1,38,3],[2,15,3,15],[2,13,2,14],[2,5,3,5],[2,6,2,8],[2,9,2,10],[2,11,3,11],[23,1,23,2],[2,1,3,1],[2,2,3,2],[2,3,3,3],[2,4,3,4]]}
[]
[]
[null,"Código","Descripción","Moneda","Tasa de Desgravamen sin retorno","Tasa de Desgravamen con retorno","TEA",null,null,"Plazo",null,"Envío información","Cuota Inicial","Valor Vivienda",null,"Máx. periodo gracia"]
[null,null,null,null,null,null,"Default","Mín.","Máx.","Mín.","Máx.",null,"Min.","Min.","Máx."]
[null,"CHFE","HIPOTECARIO INDIVIDUAL","PEN",5.0000000000000001E-4,2.6900000000000001E-3,10.5,8.75,14.000000000000002,12,300,10,0.05,0,"N/A",360]
[null,"CHFF","HIPOTECARIO SOLIDARIO","PEN",8.9999999999999998E-4,5.3800000000000002E-3,10.5,8.75,14.000000000000002,12,300,10,0.05,0,"N/A",360]
[null,"CHFI","HIPOTECARIO INDIVIDUAL","USD",5.0000000000000001E-4,2.6900000000000001E-3,11,10,14.000000000000002,12,300,3,0.05,0,"N/A",360]
[null,"CHFM","HIPOTECARIO SOLIDARIO","USD",8.9999999999999998E-4,5.3800000000000002E-3,11,10,14.000000000000002,12,300,3,0.05,0,"N/A",360]
[null,"CHFT","TECHO PROPIO INDIVIDUAL","PEN",4.6999999999999999E-4,2.6900000000000001E-3,16,10.5,20,60,300,10,0.05,0,130500,180]
[null,"CHFU","TECHO PROPIO SOLIDARIO","PEN",8.0000000000000004E-4,5.3800000000000002E-3,16,10.5,20,60,300,10,0.05,0,130500,180]
[null,"HEFV","NUEVO CREDITO MI VIVIENDA INDIVIDUAL","PEN",4.6999999999999999E-4,2.6900000000000001E-3,9.8000000000000007,9.1,15,60,240,10,7.4999999999999997E-2,63981.81818181814,464200.26,180]
[null,"HEFW","NUEVO CREDITO MI VIVIENDA SOLIDARIO","PEN",8.0000000000000004E-4,5.3800000000000002E-3,9.8000000000000007,9.1,15,60,240,10,7.4999999999999997E-2,63981.81818181814,464200.26,180]
[]
[]
[]
[]
[null,"UIT"]
[null,2014,2015,2016,2017,null,2018,2019,2020,2021,2022,2023,2024,2025,2026,2027,2028,2029,2030]
[null,3800,3850,3950,4050,null,4150,4200,4300,4400,4600,4950,5150,5350,0,0,0,0,0]
[]
[]
[]
[]
[null,"Techo Propio"]
[null,"Bono","Importe BFH"]
[null,"Bono Familiar Habitacional",{"$f":"N19*8.7","v":46544.999999999993}]
[null,"Bono Personal de las FF.AA y PNP",58181.25]
[null,"Bono Victima del Terrorismo",70282.95]
[]
[]
{"$rows_left_out":15}