{"text_format":"1","workbook":"xlsx","n_sheets":7,"sheets":["RESUMEN","simulador","simulador_1","Calculos CC","Simulador Original","Calculos Original","Simulador Original (2)"],"not_rendered":{"charts":0,"images":2,"macros":1,"external_links":0,"defined_names":1,"comments":4,"pivot_tables":0},"unopened":[],"bounds":{"document_bytes":16777216,"sheet_cells":100000,"rows_first":2000,"rows_last":500,"rows_between":2000,"halvings":0,"cell_chars":16384,"cell_head_chars":4096},"cells_cut":0,"cells_raw":0,"read":"whole","date_system":"1900"}

{"sheet":"RESUMEN","index":0,"n_rows":14,"n_cols":9,"rows_kept":14,"cut":false,"hidden":true,"merged":[]}
[]
[null,"Importe Solicitado",33050]
[null,"Tasa Anual (TEA)",13.5]
[null,"Tasa de Seguro de Desgravamen",1.4999999999999999E-4]
[null,"Plazo y  Nro. Cuotas",60,{"$f":"+simulador_1!H12","v":72}]
[null,"Fecha Desembolso","2022-04-28"]
[null,"Comisiones + Pago Casillero",3.03]
[null,"Días de Gracia",17]
[null,"Mes de No Pago 1",1]
[null,"Mes de No Pago 2",6]
[]
[null,null,"Desembolso","Interes","Impacto Interes","Suma de Cuota","Impacto Cuota Total","Cuota","Impacto Cuota"]
[null,"Simulador IBS (Original)",{"$f":"+'Simulador Original'!$G$5","v":33050},{"$f":"+SUM('Simulador Original'!$K$32:$K$103)","v":10406.780000000004},null,{"$f":"+SUM('Simulador Original'!Q32:Q103)","v":50500.950214285702},null,{"$f":"+'Simulador Original'!$Q$32","v":1010.0190042857142}]
[null,"Simulador Cambiando Cuota",{"$f":"+simulador_1!$H$5","v":34000},{"$f":"+SUM(simulador_1!$L$35:$L$106)","v":8216.1899999999951},{"$f":"+D14-D13","v":-2190.5900000000092},{"$f":"+SUM(simulador_1!$U$35:$U$106)","v":65630.273899999986},{"$f":"+F14-F13","v":15129.323685714284},{"$f":"+simulador_1!U35","v":911.53158194444438},{"$f":"+H14-H13","v":-98.487422341269848}]

{"sheet":"simulador","index":1,"n_rows":93,"n_cols":17,"rows_kept":93,"cut":false,"hidden":false,"merged":[[2,2,3,8]]}
[]
[]
[null,null,"Simulador Creditos por Convenio"]
[]
[]
[]
[null,null,"Monto solicitado:",null,null,null,34000]
[null,null,"Fecha de desembolso",null,null,null,{"$f":"TODAY()","v":"2022-09-12"}]
[null,null,"Periodo de gracia (días):",null,null,null,30]
[null,null,"Primera fecha de pago",null,null,null,{"$f":"simulador_1!Q7","v":"2022-11-12"}]
[null,null,"TEA:",null,null,null,11.5]
[null,null,"Plazo:",null,null,null,72]
[null,null,"Comisión  + Uso de Casillero*:",null,null,null,10]
[null,null,"Tipo de seguro",null,null,null,"Plan 25  - con retorno"]
[null,null,"Tasa",null,null,null,{"$f":"IFERROR(INDEX(Tabla1[tasa],MATCH(G14,Tabla1[tipo_seg],0),1),\"\")","v":4.1599999999999996E-3}]
{"$rows_left_out":79}
{"sheet":"simulador_1","index":2,"n_rows":106,"n_cols":35,"rows_kept":106,"cut":false,"hidden":false,"merged":[[1,2,1,22],[22,9,23,9],[22,10,23,10],[29,14,29,15]]}
[]
[null,null,"SIMULADOR DE CUOTAS - CRÉDITO CONVENIOS"]
[]
[]
[null,null,"Importe Solicitado",null,null,null,null,{"$f":"simulador!G7","v":34000},null,null,null,"Fecha Desembolso",null,null,null,null,{"$f":"+simulador!G8","v":"2022-09-12"}]
[null,null,"Saldo de Capital",null,null,null,null,{"$f":"H5","v":34000},null,null,null,"Fecha Final de Gracia",null,null,null,null,{"$f":"DATE(YEAR(Q5+H14),MONTH(Q5 + H14),DAY(Q5 +H14))","v":"2022-10-12"}]
[null,null,"Saldo de Interes",null,null,null,null,0,null,null,null,"Fecha de la 1° cuota",null,null,null,null,{"$f":"DATE(YEAR(EDATE(Q6,1)),MONTH(EDATE(Q6,1)),DAY(EDATE(Q6,1)))","v":"2022-11-12"},null,{"$f":"Q6-Q5","v":30}]
[null,null,"Tasa Anual (TEA)",null,null,null,null,{"$f":"simulador!G11","v":11.5},"Tasa de Gracia",{"$f":"H8","v":11.5},null,"Fecha final de vencimiento",null,null,null,null,{"$f":"IF(OR($H$16>0,$H$17>0),VLOOKUP($H$12,$A$35:$C$123,3,0),DATE(YEAR(EDATE(Q6,H12)),MONTH(EDATE(Q6,H12)),DAY(EDATE(Q6,H12))))","v":"2028-10-12"},null,null,null,null,"tipo_seg","tasa"]
[null,null,"Tasa de Seguro de Desgravámen",null,null,null,null,{"$f":"simulador!G15","v":4.1599999999999996E-3},null,null,null,"Base",null,null,null,null,360,null,null,null,null,"Plan 0 - sin retorno",8.9999999999999998E-4]
[null,null,null,null,null,null,null,null,null,null,null,"Frecuencia pago en días",null,null,null,null,30,null,null,null,null,"Plan 25  - con retorno",4.1599999999999996E-3]
[null,null,"Comisiones + Pago Casillero",null,null,null,null,{"$f":"simulador!G13","v":10},null,null,null,"Tasa Equivalente",null,null,null,null,{"$f":"ROUND((((H8/100+1)^(1/(Q9/Q10))-1)*Q9/Q10)*100,6)","v":10.934962000000001},"tea conv. A tem luego nominal anual"]
[null,null,"Plazo y  Nro. Cuotas (Aplicar Si hay Mes No Pago)",null,null,null,null,{"$f":"+H13-VLOOKUP($H$13,'Calculos CC'!$A$4:$H$99,8,0)","v":72},{"$f":"+H12","v":72},null,null,"Días entre cuotas",null,null,null,null,{"$f":"(Q8-Q6)/H12","v":30.444444444444443},"dias promedio entre cuotas"]
[null,null,"Plazo y  Nro. Cuotas",null,null,null,null,{"$f":"simulador!G12","v":72},null,null,null,"Factor Aplicado",null,null,null,null,{"$f":"($Q$11/100)/($Q$9/$Q$12)","v":9.24746786419753E-3},"tem convertida de manera nominal a los dias entre cuotas"]
[null,null,"Días de Gracia",null,null,null,null,{"$f":"simulador!G9","v":30},null,null,null,"Factor Aplicado para la cuota",null,null,null,null,{"$f":"1/((1-((1+$Q$13)^(-1*$H$12)))/$Q$13)","v":1.9083778593885367E-2},"Factor de cuota (ok)"]
[null,null,"(+/- 30 días antes de la fecha 1° cuota)",null,null,null,null,null,null,null,null,"Interes de Gracia ",null,null,null,null,{"$f":"IF(H14>0,ROUND(H6*(((1+H8/100)^(ABS(H14)/Q9))-1),4),ROUND(H6*(((1+H8/100)^(ABS(H14)/Q9))-1),4) * -1)","v":309.82389999999998},"Ok"]
{"$rows_left_out":92}
{"sheet":"Calculos CC","index":3,"n_rows":99,"n_cols":8,"rows_kept":99,"cut":false,"hidden":true,"merged":[[0,0,0,7]]}
["Factores utilizados en Meses de No Pago para cálculo del valor cuota"]
[]
["N° de Cuota","Equivalente","Fecha","Mes","Marca Cuota No Pago","Factor (10)","Acumulado","Conteo No Pagos Acum"]
[1,{"$f":"IF(E4<>\"C\",IF(ISERROR(1+B3)=TRUE,1,1+B3),IF(ISNUMBER(B3),B3,0))","v":1},{"$f":"+simulador_1!Q7","v":"2022-11-12"},{"$f":"MONTH(C4)","v":11},{"$f":"IF(ISERROR(MATCH(D4,simulador_1!$H$16:$H$17,0))=FALSE,\"C\",IF(ISERROR(MATCH(D4,simulador_1!$H$18:$H$19,0))=FALSE,\"D\",\"\"))","v":""},{"$f":"IF(E4=\"C\",0,IF(E4 =\"D\",ROUND(1/((1+simulador_1!$Q$13)^A4),9) * 2,ROUND(1/((1+simulador_1!$Q$13)^A4),9)))","v":0.99083726400000005},{"$f":"ROUND(F4,9)","v":0.99083726400000005},{"$f":"+COUNTIF($E$4:E4,\"C\")","v":0}]
[{"$f":"A4+1","v":2},{"$f":"IF(E5<>\"C\",IF(ISERROR(1+B4)=TRUE,1,1+B4),IF(ISNUMBER(B4),B4,1))","v":2},{"$f":"DATE(YEAR(C4) + 1/12,MONTH(C4)+1,DAY(C4))","v":"2022-12-12"},12,{"$f":"IF(ISERROR(MATCH(D5,simulador_1!$H$16:$H$17,0))=FALSE,\"C\",IF(ISERROR(MATCH(D5,simulador_1!$H$18:$H$19,0))=FALSE,\"D\",\"\"))","v":""},{"$f":"IF(E5=\"C\",0,IF(E5 =\"D\",ROUND(1/((1+simulador_1!$Q$13)^A5),9) * 2,ROUND(1/((1+simulador_1!$Q$13)^A5),9)))","v":0.98175848399999999},{"$f":"G4+ROUND(F5,9)","v":1.972595748},{"$f":"+COUNTIF($E$4:E5,\"C\")","v":0}]
[3,3,"2023-01-12",1,{"$f":"IF(ISERROR(MATCH(D6,simulador_1!$H$16:$H$17,0))=FALSE,\"C\",IF(ISERROR(MATCH(D6,simulador_1!$H$18:$H$19,0))=FALSE,\"D\",\"\"))","v":""},{"$f":"IF(E6=\"C\",0,IF(E6 =\"D\",ROUND(1/((1+simulador_1!$Q$13)^A6),9) * 2,ROUND(1/((1+simulador_1!$Q$13)^A6),9)))","v":0.97276289100000002},{"$f":"G5+ROUND(F6,9)","v":2.9453586390000002},{"$f":"+COUNTIF($E$4:E6,\"C\")","v":0}]
[4,4,"2023-02-12",2,{"$f":"IF(ISERROR(MATCH(D7,simulador_1!$H$16:$H$17,0))=FALSE,\"C\",IF(ISERROR(MATCH(D7,simulador_1!$H$18:$H$19,0))=FALSE,\"D\",\"\"))","v":""},{"$f":"IF(E7=\"C\",0,IF(E7 =\"D\",ROUND(1/((1+simulador_1!$Q$13)^A7),9) * 2,ROUND(1/((1+simulador_1!$Q$13)^A7),9)))","v":0.96384972099999999},3.90920836,{"$f":"+COUNTIF($E$4:E7,\"C\")","v":0}]
[5,5,"2023-03-12",3,{"$f":"IF(ISERROR(MATCH(D8,simulador_1!$H$16:$H$17,0))=FALSE,\"C\",IF(ISERROR(MATCH(D8,simulador_1!$H$18:$H$19,0))=FALSE,\"D\",\"\"))","v":""},{"$f":"IF(E8=\"C\",0,IF(E8 =\"D\",ROUND(1/((1+simulador_1!$Q$13)^A8),9) * 2,ROUND(1/((1+simulador_1!$Q$13)^A8),9)))","v":0.955018221},4.8642265810000005,{"$f":"+COUNTIF($E$4:E8,\"C\")","v":0}]
[6,6,"2023-04-12",4,{"$f":"IF(ISERROR(MATCH(D9,simulador_1!$H$16:$H$17,0))=FALSE,\"C\",IF(ISERROR(MATCH(D9,simulador_1!$H$18:$H$19,0))=FALSE,\"D\",\"\"))","v":""},{"$f":"IF(E9=\"C\",0,IF(E9 =\"D\",ROUND(1/((1+simulador_1!$Q$13)^A9),9) * 2,ROUND(1/((1+simulador_1!$Q$13)^A9),9)))","v":0.94626764100000005},5.8104942220000009,{"$f":"+COUNTIF($E$4:E9,\"C\")","v":0}]
[7,7,"2023-05-12",5,{"$f":"IF(ISERROR(MATCH(D10,simulador_1!$H$16:$H$17,0))=FALSE,\"C\",IF(ISERROR(MATCH(D10,simulador_1!$H$18:$H$19,0))=FALSE,\"D\",\"\"))","v":""},{"$f":"IF(E10=\"C\",0,IF(E10 =\"D\",ROUND(1/((1+simulador_1!$Q$13)^A10),9) * 2,ROUND(1/((1+simulador_1!$Q$13)^A10),9)))","v":0.93759724099999997},6.7480914630000006,{"$f":"+COUNTIF($E$4:E10,\"C\")","v":0}]
[8,8,"2023-06-12",6,{"$f":"IF(ISERROR(MATCH(D11,simulador_1!$H$16:$H$17,0))=FALSE,\"C\",IF(ISERROR(MATCH(D11,simulador_1!$H$18:$H$19,0))=FALSE,\"D\",\"\"))","v":""},{"$f":"IF(E11=\"C\",0,IF(E11 =\"D\",ROUND(1/((1+simulador_1!$Q$13)^A11),9) * 2,ROUND(1/((1+simulador_1!$Q$13)^A11),9)))","v":0.92900628500000004},7.6770977480000004,{"$f":"+COUNTIF($E$4:E11,\"C\")","v":0}]
[9,9,"2023-07-12",7,{"$f":"IF(ISERROR(MATCH(D12,simulador_1!$H$16:$H$17,0))=FALSE,\"C\",IF(ISERROR(MATCH(D12,simulador_1!$H$18:$H$19,0))=FALSE,\"D\",\"\"))","v":""},{"$f":"IF(E12=\"C\",0,IF(E12 =\"D\",ROUND(1/((1+simulador_1!$Q$13)^A12),9) * 2,ROUND(1/((1+simulador_1!$Q$13)^A12),9)))","v":0.92049404599999995},8.5975917939999995,{"$f":"+COUNTIF($E$4:E12,\"C\")","v":0}]
[10,10,"2023-08-12",8,{"$f":"IF(ISERROR(MATCH(D13,simulador_1!$H$16:$H$17,0))=FALSE,\"C\",IF(ISERROR(MATCH(D13,simulador_1!$H$18:$H$19,0))=FALSE,\"D\",\"\"))","v":""},{"$f":"IF(E13=\"C\",0,IF(E13 =\"D\",ROUND(1/((1+simulador_1!$Q$13)^A13),9) * 2,ROUND(1/((1+simulador_1!$Q$13)^A13),9)))","v":0.91205980200000003},9.5096515959999994,{"$f":"+COUNTIF($E$4:E13,\"C\")","v":0}]
[11,11,"2023-09-12",9,{"$f":"IF(ISERROR(MATCH(D14,simulador_1!$H$16:$H$17,0))=FALSE,\"C\",IF(ISERROR(MATCH(D14,simulador_1!$H$18:$H$19,0))=FALSE,\"D\",\"\"))","v":""},{"$f":"IF(E14=\"C\",0,IF(E14 =\"D\",ROUND(1/((1+simulador_1!$Q$13)^A14),9) * 2,ROUND(1/((1+simulador_1!$Q$13)^A14),9)))","v":0.90370283900000004},10.413354434999999,{"$f":"+COUNTIF($E$4:E14,\"C\")","v":0}]
[12,12,"2023-10-12",10,{"$f":"IF(ISERROR(MATCH(D15,simulador_1!$H$16:$H$17,0))=FALSE,\"C\",IF(ISERROR(MATCH(D15,simulador_1!$H$18:$H$19,0))=FALSE,\"D\",\"\"))","v":""},{"$f":"IF(E15=\"C\",0,IF(E15 =\"D\",ROUND(1/((1+simulador_1!$Q$13)^A15),9) * 2,ROUND(1/((1+simulador_1!$Q$13)^A15),9)))","v":0.89542244900000001},11.308776883999998,{"$f":"+COUNTIF($E$4:E15,\"C\")","v":0}]
{"$rows_left_out":85}
{"sheet":"Simulador Original","index":4,"n_rows":106,"n_cols":28,"rows_kept":106,"cut":false,"hidden":true,"merged":[[1,2,1,18]]}
[]
[null,null,"SIMULADOR DE CUOTAS - CRÉDITO CONVENIOS"]
[]
[]
[null,null,"Importe Solicitado",null,null,null,{"$f":"+RESUMEN!$C$2","v":33050},null,null,null,"Fecha Desembolso",null,null,null,null,{"$f":"+RESUMEN!$C$6","v":"2022-04-28"}]
[null,null,"Saldo de Capital",null,null,null,{"$f":"G5","v":33050},null,null,null,"Fecha Final de Gracia",null,null,null,null,{"$f":"DATE(YEAR(P5+G14),MONTH(P5 + G14),DAY(P5 +G14))","v":"2022-05-15"}]
[null,null,"Saldo de Interes",null,null,null,0,null,null,null,"Fecha de la 1° cuota",null,null,null,null,{"$f":"DATE(YEAR(EDATE(P6,1)),MONTH(EDATE(P6,1)),DAY(EDATE(P6,1)))","v":"2022-06-15"}]
[null,null,"Tasa Anual (TEA)",null,null,null,{"$f":"+RESUMEN!$C$3","v":13.5},"Tasa de Gracia",{"$f":"G8","v":13.5},null,"Fecha final de vencimiento",null,null,null,null,{"$f":"IF(OR($G$16>0,$G$17>0),VLOOKUP($G$12,$A$32:$C$120,3,0),DATE(YEAR(EDATE(P6,G12)),MONTH(EDATE(P6,G12)),DAY(EDATE(P6,G12))))","v":"2027-05-15"}]
[null,null,"Tasa de Seguro de Desgravámen",null,null,null,{"$f":"+RESUMEN!$C$4","v":1.4999999999999999E-4},null,null,null,"Base",null,null,null,null,360]
[null,null,null,null,null,null,null,null,null,null,"Frecuencia pago en días",null,null,null,null,30]
[null,null,"Comisiones + Pago Casillero",null,null,null,{"$f":"+RESUMEN!$C$7","v":3.03},null,null,null,"Tasa Equivalente",null,null,null,null,{"$f":"ROUND((((G8/100+1)^(1/(P9/P10))-1)*P9/P10)*100,6)","v":12.730316999999999},"tea conv. A tem luego nominal anual"]
[null,null,"Plazo y  Nro. Cuotas (Aplicar Si hay Mes No Pago)",null,null,null,{"$f":"+G13-VLOOKUP($G$13,'Calculos Original'!$A$4:$H$99,8,0)","v":50},{"$f":"+G12","v":50},null,null,"Días entre cuotas",null,null,null,null,{"$f":"(P8-P6)/G12","v":36.520000000000003},"dias promedio entre cuotas"]
[null,null,"Plazo y  Nro. Cuotas",null,null,null,{"$f":"+RESUMEN!$C$5","v":60},null,null,null,"Factor Aplicado",null,null,null,null,{"$f":"($P$11/100)/($P$9/$P$12)","v":1.2914199356666668E-2},"tem convertida de manera nominal a los dias entre cuotas"]
[null,null,"Días de Gracia",null,null,null,{"$f":"+RESUMEN!$C$8","v":17},null,null,null,"Factor Aplicado para la cuota",null,null,null,null,{"$f":"1/((1-((1+$P$13)^(-1*$G$12)))/$P$13)","v":2.727172817939184E-2},"Factor de cuota (ok)"]
[null,null,"(+/- 30 días antes de la fecha 1° cuota)",null,null,null,null,null,null,null,"Interes de Gracia ",null,null,null,null,{"$f":"IF(G14>0,ROUND(G6*(((1+G8/100)^(ABS(G14)/P9))-1),4),ROUND(G6*(((1+G8/100)^(ABS(G14)/P9))-1),4) * -1)","v":198.227},"Ok"]
{"$rows_left_out":92}
{"sheet":"Calculos Original","index":5,"n_rows":99,"n_cols":8,"rows_kept":99,"cut":false,"hidden":true,"merged":[[0,0,0,6]]}
["Factores utilizados en Meses de No Pago para cálculo del valor cuota"]
[]
["N° de Cuota","Equivalente","Fecha","Mes","Marca Cuota No Pago","Factor (10)","Acumulado","Conteo No Pagos Acum"]
[1,{"$f":"IF(E4<>\"C\",IF(ISERROR(1+B3)=TRUE,1,1+B3),IF(ISNUMBER(B3),B3,0))","v":0},{"$f":"'Simulador Original'!P7","v":"2022-06-15"},{"$f":"MONTH(C4)","v":6},{"$f":"IF(ISERROR(MATCH(D4,'Simulador Original'!$G$16:$G$17,0))=FALSE,\"C\",IF(ISERROR(MATCH(D4,'Simulador Original'!$G$18:$G$19,0))=FALSE,\"D\",\"\"))","v":"C"},{"$f":"IF(E4=\"C\",0,IF(E4 =\"D\",ROUND(1/((1+'Simulador Original'!$P$13)^A4),9) * 2,ROUND(1/((1+'Simulador Original'!$P$13)^A4),9)))","v":0},{"$f":"ROUND(F4,9)","v":0},{"$f":"+COUNTIF($E$4:E4,\"C\")","v":1}]
[{"$f":"A4+1","v":2},{"$f":"IF(E5<>\"C\",IF(ISERROR(1+B4)=TRUE,1,1+B4),IF(ISNUMBER(B4),B4,1))","v":1},{"$f":"DATE(YEAR(C4) + 1/12,MONTH(C4)+1,DAY(C4))","v":"2022-07-15"},7,{"$f":"IF(ISERROR(MATCH(D5,'Simulador Original'!$G$16:$G$17,0))=FALSE,\"C\",IF(ISERROR(MATCH(D5,'Simulador Original'!$G$18:$G$19,0))=FALSE,\"D\",\"\"))","v":""},{"$f":"IF(E5=\"C\",0,IF(E5 =\"D\",ROUND(1/((1+'Simulador Original'!$P$13)^A5),9) * 2,ROUND(1/((1+'Simulador Original'!$P$13)^A5),9)))","v":0.97466345300000001},{"$f":"G4+ROUND(F5,9)","v":0.97466345300000001},{"$f":"+COUNTIF($E$4:E5,\"C\")","v":1}]
[3,2,"2022-08-15",8,{"$f":"IF(ISERROR(MATCH(D6,'Simulador Original'!$G$16:$G$17,0))=FALSE,\"C\",IF(ISERROR(MATCH(D6,'Simulador Original'!$G$18:$G$19,0))=FALSE,\"D\",\"\"))","v":""},{"$f":"IF(E6=\"C\",0,IF(E6 =\"D\",ROUND(1/((1+'Simulador Original'!$P$13)^A6),9) * 2,ROUND(1/((1+'Simulador Original'!$P$13)^A6),9)))","v":0.96223693300000002},{"$f":"G5+ROUND(F6,9)","v":1.936900386},{"$f":"+COUNTIF($E$4:E6,\"C\")","v":1}]
[4,3,"2022-09-15",9,{"$f":"IF(ISERROR(MATCH(D7,'Simulador Original'!$G$16:$G$17,0))=FALSE,\"C\",IF(ISERROR(MATCH(D7,'Simulador Original'!$G$18:$G$19,0))=FALSE,\"D\",\"\"))","v":""},{"$f":"IF(E7=\"C\",0,IF(E7 =\"D\",ROUND(1/((1+'Simulador Original'!$P$13)^A7),9) * 2,ROUND(1/((1+'Simulador Original'!$P$13)^A7),9)))","v":0.94996884599999998},2.886869232,{"$f":"+COUNTIF($E$4:E7,\"C\")","v":1}]
[5,4,"2022-10-15",10,{"$f":"IF(ISERROR(MATCH(D8,'Simulador Original'!$G$16:$G$17,0))=FALSE,\"C\",IF(ISERROR(MATCH(D8,'Simulador Original'!$G$18:$G$19,0))=FALSE,\"D\",\"\"))","v":""},{"$f":"IF(E8=\"C\",0,IF(E8 =\"D\",ROUND(1/((1+'Simulador Original'!$P$13)^A8),9) * 2,ROUND(1/((1+'Simulador Original'!$P$13)^A8),9)))","v":0.93785717199999996},3.8247264039999997,{"$f":"+COUNTIF($E$4:E8,\"C\")","v":1}]
[6,5,"2022-11-15",11,{"$f":"IF(ISERROR(MATCH(D9,'Simulador Original'!$G$16:$G$17,0))=FALSE,\"C\",IF(ISERROR(MATCH(D9,'Simulador Original'!$G$18:$G$19,0))=FALSE,\"D\",\"\"))","v":""},{"$f":"IF(E9=\"C\",0,IF(E9 =\"D\",ROUND(1/((1+'Simulador Original'!$P$13)^A9),9) * 2,ROUND(1/((1+'Simulador Original'!$P$13)^A9),9)))","v":0.92589991599999999},4.7506263199999994,{"$f":"+COUNTIF($E$4:E9,\"C\")","v":1}]
[7,6,"2022-12-15",12,{"$f":"IF(ISERROR(MATCH(D10,'Simulador Original'!$G$16:$G$17,0))=FALSE,\"C\",IF(ISERROR(MATCH(D10,'Simulador Original'!$G$18:$G$19,0))=FALSE,\"D\",\"\"))","v":""},{"$f":"IF(E10=\"C\",0,IF(E10 =\"D\",ROUND(1/((1+'Simulador Original'!$P$13)^A10),9) * 2,ROUND(1/((1+'Simulador Original'!$P$13)^A10),9)))","v":0.91409510900000002},5.6647214289999992,{"$f":"+COUNTIF($E$4:E10,\"C\")","v":1}]
[8,6,"2023-01-15",1,{"$f":"IF(ISERROR(MATCH(D11,'Simulador Original'!$G$16:$G$17,0))=FALSE,\"C\",IF(ISERROR(MATCH(D11,'Simulador Original'!$G$18:$G$19,0))=FALSE,\"D\",\"\"))","v":"C"},{"$f":"IF(E11=\"C\",0,IF(E11 =\"D\",ROUND(1/((1+'Simulador Original'!$P$13)^A11),9) * 2,ROUND(1/((1+'Simulador Original'!$P$13)^A11),9)))","v":0},5.6647214289999992,{"$f":"+COUNTIF($E$4:E11,\"C\")","v":2}]
[9,7,"2023-02-15",2,{"$f":"IF(ISERROR(MATCH(D12,'Simulador Original'!$G$16:$G$17,0))=FALSE,\"C\",IF(ISERROR(MATCH(D12,'Simulador Original'!$G$18:$G$19,0))=FALSE,\"D\",\"\"))","v":""},{"$f":"IF(E12=\"C\",0,IF(E12 =\"D\",ROUND(1/((1+'Simulador Original'!$P$13)^A12),9) * 2,ROUND(1/((1+'Simulador Original'!$P$13)^A12),9)))","v":0.89093509500000001},6.5556565239999989,{"$f":"+COUNTIF($E$4:E12,\"C\")","v":2}]
[10,8,"2023-03-15",3,{"$f":"IF(ISERROR(MATCH(D13,'Simulador Original'!$G$16:$G$17,0))=FALSE,\"C\",IF(ISERROR(MATCH(D13,'Simulador Original'!$G$18:$G$19,0))=FALSE,\"D\",\"\"))","v":""},{"$f":"IF(E13=\"C\",0,IF(E13 =\"D\",ROUND(1/((1+'Simulador Original'!$P$13)^A13),9) * 2,ROUND(1/((1+'Simulador Original'!$P$13)^A13),9)))","v":0.87957607400000004},7.4352325979999989,{"$f":"+COUNTIF($E$4:E13,\"C\")","v":2}]
[11,9,"2023-04-15",4,{"$f":"IF(ISERROR(MATCH(D14,'Simulador Original'!$G$16:$G$17,0))=FALSE,\"C\",IF(ISERROR(MATCH(D14,'Simulador Original'!$G$18:$G$19,0))=FALSE,\"D\",\"\"))","v":""},{"$f":"IF(E14=\"C\",0,IF(E14 =\"D\",ROUND(1/((1+'Simulador Original'!$P$13)^A14),9) * 2,ROUND(1/((1+'Simulador Original'!$P$13)^A14),9)))","v":0.86836187600000003},8.3035944739999987,{"$f":"+COUNTIF($E$4:E14,\"C\")","v":2}]
[12,10,"2023-05-15",5,{"$f":"IF(ISERROR(MATCH(D15,'Simulador Original'!$G$16:$G$17,0))=FALSE,\"C\",IF(ISERROR(MATCH(D15,'Simulador Original'!$G$18:$G$19,0))=FALSE,\"D\",\"\"))","v":""},{"$f":"IF(E15=\"C\",0,IF(E15 =\"D\",ROUND(1/((1+'Simulador Original'!$P$13)^A15),9) * 2,ROUND(1/((1+'Simulador Original'!$P$13)^A15),9)))","v":0.85729065400000004},9.1608851279999985,{"$f":"+COUNTIF($E$4:E15,\"C\")","v":2}]
{"$rows_left_out":85}
{"sheet":"Simulador Original (2)","index":6,"n_rows":106,"n_cols":28,"rows_kept":106,"cut":false,"hidden":true,"merged":[[1,2,1,18]]}
[]
[null,null,"SIMULADOR DE CUOTAS - CRÉDITO CONVENIOS"]
[]
[]
[null,null,"Importe Solicitado",null,null,null,49420,null,null,null,"Fecha Desembolso",null,null,null,null,"2018-01-05"]
[null,null,"Saldo de Capital",null,null,null,49420,null,null,null,"Fecha Final de Gracia",null,null,null,null,"2018-02-15"]
[null,null,"Saldo de Interes",null,null,null,0,null,null,null,"Fecha de la 1° cuota",null,null,null,null,"2018-03-15"]
[null,null,"Tasa Anual (TEA)",null,null,null,14.03,"Tasa de Gracia",14.03,null,"Fecha final de vencimiento",null,null,null,null,"2020-06-15"]
[null,null,"Tasa de Seguro de Desgravámen",null,null,null,8.9999999999999998E-4,null,null,null,"Base",null,null,null,null,360]
[null,null,null,null,null,null,null,null,null,null,"Frecuencia pago en días",null,null,null,null,30]
[null,null,"Comisiones + Pago Casillero",null,null,null,16.5,null,null,null,"Tasa Equivalente",null,null,null,null,13.201224,"tea conv. A tem luego nominal anual"]
[null,null,null,null,null,null,null,null,null,null,"Días entre cuotas",null,null,null,null,35.458333333333336,"dias promedio entre cuotas"]
[null,null,"Plazo y  Nro. Cuotas",null,null,null,24,24,null,null,"Factor Aplicado",null,null,null,null,1.3002594472222224E-2,"tem convertida de manera nominal a los dias entre cuotas"]
[null,null,"Días de Gracia",null,null,null,41,null,null,null,"Factor Aplicado para la cuota",null,null,null,null,4.8773686479230145E-2,"Factor de cuota (ok)"]
[null,null,"(+/- 30 días antes de la fecha 1° cuota)",null,null,null,null,null,null,null,"Interes de Gracia ",null,null,null,null,744.51130000000001,"Ok"]
{"$rows_left_out":91}